7-Thiabicyclo[4.2.0]octa-1,3,5-trien-8-one
- Formula: C7H4OS
- Molecular weight: 136.171
- IUPAC Standard InChIKey: CAEMCYVDPUUSQT-UHFFFAOYSA-N
- CAS Registry Number: 21083-36-3
- Chemical structure:
View 3d structure (requires JavaScript / HTML 5) - Permanent link for this species. Use this link for bookmarking this species for future reference.

Gas phase ion energetics data

Data compiled by: Sharon G. Lias, Rhoda D. Levin, and Sherif A. Kafafi
Ionization energy determinations
IE (eV) | Method | Reference | Comment |
---|---|---|---|
8.1 | PE | Schulz and Schweig, 1979 | |
8.56 | PE | Schulz and Schweig, 1979 | Vertical value |

References

Schulz and Schweig, 1979
Schulz, R.; Schweig, A.,
Elucidation of thermal reactions by variable temperature photoelectron spectral detection of reactive intermediates. The UV photoelectron spectra of transient fulveneketene, fulvenethioketene, a ketoketene, and thiobenzpropiolactone,
Tetrahedron Lett., 1979, 59. [all data]