2,4-Cyclohexadien-1-one, 6-carbonyl-
- Formula: C7H4O2
- Molecular weight: 120.1055
- IUPAC Standard InChIKey: MCYLBKWHWSBJCZ-UHFFFAOYSA-N
- CAS Registry Number: 21083-33-0
- Chemical structure:
View 3d structure (requires JavaScript / HTML 5) - Permanent link for this species. Use this link for bookmarking this species for future reference.

Gas phase ion energetics data

Data compiled by: Sharon G. Lias, Rhoda D. Levin, and Sherif A. Kafafi
Ionization energy determinations
IE (eV) | Method | Reference | Comment |
---|---|---|---|
8.0 | PE | Schulz and Schweig, 1979 | |
8.43 | PE | Schulz and Schweig, 1979 | Vertical value |

References

Schulz and Schweig, 1979
Schulz, R.; Schweig, A.,
Elucidation of thermal reactions by variable temperature photoelectron spectral detection of reactive intermediates. The UV photoelectron spectra of transient fulveneketene, fulvenethioketene, a ketoketene, and thiobenzpropiolactone,
Tetrahedron Lett., 1979, 59. [all data]