Chloromethylene
- Formula: CHCl
- Molecular weight: 48.472
- IUPAC Standard InChIKey: LKYXEULZVGJVTG-UHFFFAOYSA-N
- CAS Registry Number: 2108-20-5
- Chemical structure:
View 3d structure (requires JavaScript / HTML 5) - Permanent link for this species. Use this link for bookmarking this species for future reference.

Reaction thermochemistry data

Data compiled by: John E. Bartmess
Individual Reactions
(CAS Reg. No. 32180-91-9 • 4294967295) +
= CAS Reg. No. 32180-91-9
By formula: (CAS Reg. No. 32180-91-9 • 4294967295CHCl) + CHCl = CAS Reg. No. 32180-91-9
Quantity | Value | Units | Method | Reference | Comment |
---|---|---|---|---|---|
ΔrH° | 153. ± 13. | kJ/mol | N/A | Born, Ingemann, et al., 2000 | gas phase; D-EA from this reference yields BDE = 96.0±3.2 kcal/mol |
ΔrH° | 155. ± 11. | kJ/mol | CIDT | Poutsma, Paulino, et al., 1997 | gas phase |

Gas phase ion energetics data

Data evaluated as indicated in comments:
HL - Edward P. Hunter and Sharon G. Lias
Data compiled as indicated in comments:
LBLHLM - Sharon G. Lias, John E. Bartmess, Joel F. Liebman, John L. Holmes, Rhoda D. Levin, and W. Gary Mallard
B - John E. Bartmess
Quantity | Value | Units | Method | Reference | Comment |
---|---|---|---|---|---|
Proton affinity (review) | 874.1 | kJ/mol | N/A | Hunter and Lias, 1998 | HL |
Quantity | Value | Units | Method | Reference | Comment |
Gas basicity | 839.9 | kJ/mol | N/A | Hunter and Lias, 1998 | HL |
Electron affinity determinations
EA (eV) | Method | Reference | Comment |
---|---|---|---|
1.2100 ± 0.0050 | LPES | Gilles, Ervin, et al., 1992 | Triplet state is 4.2±2.5 kcal/mol higher in energy than neutral singlet; B |
1.2130 ± 0.0050 | LPES | Murray, Leopold, et al., 1988 | Singlet-triplet splitting in neutral < 11.4 kcal/mol; B |
Ionization energy determinations
IE (eV) | Method | Reference | Comment |
---|---|---|---|
9.84 | DER | Lias, Karpas, et al., 1985 | LBLHLM |

Gas phase thermochemistry data

Quantity | Value | Units | Method | Reference | Comment |
---|---|---|---|---|---|
ΔfH°gas | 334.72 | kJ/mol | Review | Chase, 1998 | Data last reviewed in December, 1969 |
Quantity | Value | Units | Method | Reference | Comment |
S°gas,1 bar | 234.91 | J/mol*K | Review | Chase, 1998 | Data last reviewed in December, 1969 |
Gas Phase Heat Capacity (Shomate Equation)
Cp° = A + B*t + C*t2 + D*t3 +
E/t2
H° − H°298.15= A*t + B*t2/2 +
C*t3/3 + D*t4/4 − E/t + F − H
S° = A*ln(t) + B*t + C*t2/2 + D*t3/3 −
E/(2*t2) + G
Cp = heat capacity (J/mol*K)
H° = standard enthalpy (kJ/mol)
S° = standard entropy (J/mol*K)
t = temperature (K) / 1000.
View plot Requires a JavaScript / HTML 5 canvas capable browser.
Temperature (K) | 298. to 1400. | 1400. to 6000. |
---|---|---|
A | 33.16130 | 85.98873 |
B | 10.59180 | -13.76854 |
C | 24.21080 | 2.599716 |
D | -12.48460 | -0.169481 |
E | -0.124360 | -19.71497 |
F | 323.7546 | 267.6145 |
G | 270.2161 | 291.4608 |
H | 334.7204 | 334.7204 |
Reference | Chase, 1998 | Chase, 1998 |
Comment | Data last reviewed in December, 1969 | Data last reviewed in December, 1969 |

References

Born, Ingemann, et al., 2000
Born, M.; Ingemann, S.; Nibbering, N.M.M.,
Thermochemical properties of halogen-substituted methanes, methyl radicals, and carbenes in the gas phase,
Int. J. Mass Spectrom., 2000, 194, 2-3, 103-113, https://doi.org/10.1016/S1387-3806(99)00125-6
. [all data]
Poutsma, Paulino, et al., 1997
Poutsma, J.C.; Paulino, J.A.; Squires, R.R.,
Absolute Heats of Formation of CHCl, CHF, and CClF. A Gas-Phase Experimental and G2 Theoretical Study.,
J. Phys. Chem. A, 1997, 101, 29, 5327, https://doi.org/10.1021/jp970778f
. [all data]
Hunter and Lias, 1998
Hunter, E.P.; Lias, S.G.,
Evaluated Gas Phase Basicities and Proton Affinities of Molecules: An Update,
J. Phys. Chem. Ref. Data, 1998, 27, 3, 413-656, https://doi.org/10.1063/1.556018
. [all data]
Gilles, Ervin, et al., 1992
Gilles, M.K.; Ervin, K.M.; Ho, J.; Lineberger, W.C.,
Negative Ion Photoelectron Spectroscopy of HCF-, HCCl-, HCBr-, and HCI- - Photoelectron Angular Distributions and Neutral Triplet Excitation,
J. Phys. Chem., 1992, 96, 3, 1130, https://doi.org/10.1021/j100182a021
. [all data]
Murray, Leopold, et al., 1988
Murray, K.K.; Leopold, D.G.; Miller, T.M.; Lineberger, W.C.,
Photoelectron Spectroscopy of the Halocarbene Anions HCF-, HCCl-, HCBr-, HCI-, CF2-, and CCl2-,
J. Chem. Phys., 1988, 89, 9, 5442, https://doi.org/10.1063/1.455596
. [all data]
Lias, Karpas, et al., 1985
Lias, S.G.; Karpas, Z.; Liebman, J.F.,
Halomethylenes: Effects of halogen substitution on absolute heats of formation,
J. Am. Chem. Soc., 1985, 107, 6089. [all data]