Isocyanobutanetungsten pentacarbonyl
- Formula: C10H9NO5W
- Molecular weight: 407.02
- IUPAC Standard InChIKey: AXKGLSLZFIJRKC-UHFFFAOYSA-N
- CAS Registry Number: 21077-26-9
- Chemical structure:
View 3d structure (requires JavaScript / HTML 5) - Permanent link for this species. Use this link for bookmarking this species for future reference.

Gas phase ion energetics data

Data compiled by: Henry M. Rosenstock, Keith Draxl, Bruce W. Steiner, and John T. Herron
Ionization energy determinations
IE (eV) | Method | Reference |
---|---|---|
7.60 ± 0.05 | EI | Distefano, Innorta, et al., 1968 |

References

Distefano, Innorta, et al., 1968
Distefano, G.; Innorta, G.; Pignataro, S.; Foffani, A.,
Correlation between the ionization potentials of transition metal complexes and of the corresponding ligands,
J. Organometal. Chem., 1968, 14, 165. [all data]