Imidazolidinetrione,dipropyl-
- Formula: C9H14N2O3
- Molecular weight: 198.2191
- IUPAC Standard InChIKey: GFNNBLORESRJGK-UHFFFAOYSA-N
- CAS Registry Number: 21036-96-4
- Chemical structure:
View 3d structure (requires JavaScript / HTML 5) - Permanent link for this species. Use this link for bookmarking this species for future reference.

Gas phase ion energetics data

Data compiled by: Sharon G. Lias, Rhoda D. Levin, and Sherif A. Kafafi
Ionization energy determinations
IE (eV) | Method | Reference |
---|---|---|
9.90 | PE | Meeks, Arnett, et al., 1975 |

References

Meeks, Arnett, et al., 1975
Meeks, J.L.; Arnett, J.F.; Larson, D.; McGlynn, S.P.,
Photoelectron spectroscopy of carbonyls. Ionization assignments,
Chem. Phys. Lett., 1975, 30, 190. [all data]