2-Propanone, 1-(ethylthio)-
- Formula: C5H10OS
- Molecular weight: 118.197
- IUPAC Standard InChIKey: ZKDXKBIOEVBFGV-UHFFFAOYSA-N
- CAS Registry Number: 20996-62-7
- Chemical structure:
View 3d structure (requires JavaScript / HTML 5) - Other names: (Ethylthio)acetone; Ethyl 2-oxopropyl sulfide; CH3COCH2SCH2CH3; α-(Ethylthio)acetone; Thioethoxy acetone; 1-(Ethylthio)-2-propanone; 1-(ethylthio)acetone

Gas phase ion energetics data

Data compiled as indicated in comments:
LBLHLM - Sharon G. Lias, John E. Bartmess, Joel F. Liebman, John L. Holmes, Rhoda D. Levin, and W. Gary Mallard
Ionization energy determinations
IE (eV) | Method | Reference | Comment |
---|---|---|---|
8.72 | PE | Olivato, Guerrero, et al., 1984 | Vertical value; LBLHLM |

References

Olivato, Guerrero, et al., 1984
Olivato, P.R.; Guerrero, S.A.; Modelli, A.; Granozzi, G.; Jones, D.; Distefano, G.,
Electronic interaction in heterosubstituted acetones studied by means of ultraviolet photoelectron and electron transmission spectroscopy,
J. Chem. Soc. Perkin Trans. 2, 1984, 1505. [all data]