Pyrrolo[2,1,5-cd]indolizine
- Formula: C10H7N
- Molecular weight: 141.1693
- IUPAC Standard InChIKey: DTPOQEUUHFQKSS-UHFFFAOYSA-N
- CAS Registry Number: 209-81-4
- Chemical structure:
View 3d structure (requires JavaScript / HTML 5) - Permanent link for this species. Use this link for bookmarking this species for future reference.

Gas phase ion energetics data

Data compiled by: Sharon G. Lias, Rhoda D. Levin, and Sherif A. Kafafi
Ionization energy determinations
IE (eV) | Method | Reference | Comment |
---|---|---|---|
7.63 | PE | Palmer, Leaver, et al., 1977 | Vertical value |

References

Palmer, Leaver, et al., 1977
Palmer, M.H.; Leaver, D.; Nisbet, J.D.; Millar, R.W.; Egdell, R.,
The electronic structure of some J. Heterocycl. Chem. with bridgehead nitrogen: photoelectron spectra and ab initio molecular orbital calculations,
J. Mol. Struct., 1977, 42, 85. [all data]