Stannane, triethylmethyl-
- Formula: C7H18Sn
- Molecular weight: 220.928
- IUPAC Standard InChIKey: MCJQQYZNMQMKCL-UHFFFAOYSA-N
- CAS Registry Number: 2097-60-1
- Chemical structure:
View 3d structure (requires JavaScript / HTML 5) - Other names: Methyl triethyltin; Triethylmethylstannane; (C2H5)3(CH3)Sn

Condensed phase thermochemistry data

Data compiled by: José A. Martinho Simões
Quantity | Value | Units | Method | Reference | Comment |
---|---|---|---|---|---|
ΔfH°liquid | -222.8 ± 4.3 | kJ/mol | Review | Martinho Simões | |
Quantity | Value | Units | Method | Reference | Comment |
ΔcH°liquid | -5681.9 ± 4.2 | kJ/mol | CC-SB | Dillard, McNeill, et al., 1958 |

Gas phase ion energetics data

Data compiled as indicated in comments:
LLK - Sharon G. Lias, Rhoda D. Levin, and Sherif A. Kafafi
Ionization energy determinations
IE (eV) | Method | Reference | Comment |
---|---|---|---|
8.95 | PE | Kochi, 1980 | Vertical value; LLK |

References

Martinho Simões
Martinho Simões, J.A.,
Private communication (see http://webbook.nist.gov/chemistry/om/). [all data]
Dillard, McNeill, et al., 1958
Dillard, C.R.; McNeill, E.H.; Simmons, D.E.; Yeldell, J.B.,
J. Am. Chem. Soc., 1958, 80, 3607. [all data]
Kochi, 1980
Kochi, J.K.,
The role of electron transfer and charge transfer in organometallic chemistry,
Pure Appl. Chem., 1980, 52, 571. [all data]