Cyclopentane,1,2-bis(methylene)-
- Formula: C7H10
- Molecular weight: 94.1543
- IUPAC Standard InChIKey: XBJHZEUYCYYCLK-UHFFFAOYSA-N
- CAS Registry Number: 20968-70-1
- Chemical structure:
View 3d structure (requires JavaScript / HTML 5) - Species with the same structure:

Gas phase thermochemistry data

Data compiled by: Hussein Y. Afeefy, Joel F. Liebman, and Stephen E. Stein
Quantity | Value | Units | Method | Reference | Comment |
---|---|---|---|---|---|
ΔfH°gas | 94.1 | kJ/mol | Chyd | Roth, Adamczak, et al., 1991 |

Reaction thermochemistry data

Data compiled by: Hussein Y. Afeefy, Joel F. Liebman, and Stephen E. Stein
Individual Reactions
By formula: 2H2 + C7H10 = C7H14
Quantity | Value | Units | Method | Reference | Comment |
---|---|---|---|---|---|
ΔrH° | -231. ± 0.8 | kJ/mol | Chyd | Roth, Adamczak, et al., 1991 | liquid phase |

Gas phase ion energetics data

Data compiled by: Sharon G. Lias, Rhoda D. Levin, and Sherif A. Kafafi
Ionization energy determinations
IE (eV) | Method | Reference |
---|---|---|
8.58 | PE | Scharf, Plum, et al., 1979 |

References

Roth, Adamczak, et al., 1991
Roth, W.R.; Adamczak, O.; Breuckmann, R.; Lennartz, H.-W.; Boese, R.,
Die Berechnung von Resonanzenergien; das MM2ERW-Kraftfeld,
Chem. Ber., 1991, 124, 2499-2521. [all data]
Scharf, Plum, et al., 1979
Scharf, H.-D.; Plum, H.; Fleischhauer, J.; Schleker, W.,
Zur Diels-Alder-Reaktivitat s-cis- fixierter 1,3-Diene,
Chem. Ber., 1979, 112, 862. [all data]