1,3-Oxathiolane
- Formula: C3H6OS
- Molecular weight: 90.144
- IUPAC Standard InChIKey: WJJSZTJGFCFNKI-UHFFFAOYSA-N
- CAS Registry Number: 2094-97-5
- Chemical structure:
View 3d structure (requires JavaScript / HTML 5) - Other names: 1,3-Oxathiole, dihydro-; 1,3-Oxothiolane

Gas phase ion energetics data

Data compiled by: Sharon G. Lias, Rhoda D. Levin, and Sherif A. Kafafi
Ionization energy determinations
IE (eV) | Method | Reference |
---|---|---|
9. ± 0.05 | EI | Conde-Caprace and Collin, 1972 |
Appearance energy determinations
Ion | AE (eV) | Other Products | Method | Reference | Comment |
---|---|---|---|---|---|
CHS+ | 12.9 ± 0.2 | ? | EI | Conde-Caprace and Collin, 1972 | |
CH2OS+ | 10.4 ± 0.3 | C2H4 | EI | Conde-Caprace and Collin, 1972 | |
CH2S+ | 12.5 ± 0.2 | ? | EI | Conde-Caprace and Collin, 1972 | |
C2H3S+ | 12.3 ± 0.1 | CH2O+H | EI | Conde-Caprace and Collin, 1972 | |
C2H4S+ | 10.5 ± 0.1 | CH2O | EI | Conde-Caprace and Collin, 1972 | |
C2H5S+ | 10.4 ± 0.1 | CHO | EI | Conde-Caprace and Collin, 1972 | |
C3H5OS+ | 10.8 ± 0.1 | H | EI | Conde-Caprace and Collin, 1972 |

Kovats' RI, non-polar column, isothermal

Column type | Active phase | Temperature (C) | I | Reference | Comment |
---|---|---|---|---|---|
Capillary | OV-101 | 130. | 788. | Misharina and Golovnya, 1994 | He; Column length: 50. m; Column diameter: 0.32 mm |
Capillary | OV-101 | 150. | 792. | Misharina and Golovnya, 1994 | He; Column length: 50. m; Column diameter: 0.32 mm |
Capillary | SE-52 | 130. | 818. | Misharina and Golovnya, 1994 | 60. m/0.32 mm/2. μm, He |
Capillary | SE-52 | 150. | 832. | Misharina and Golovnya, 1994 | 60. m/0.32 mm/2. μm, He |
Packed | Apiezon M | 130. | 806. | Garbuzov, Misharina, et al., 1985 | He or N2, Chromosorb W, AW-DMCS; Column length: 2.1 m |

Van Den Dool and Kratz RI, non-polar column, temperature ramp

Column type | Active phase | I | Reference | Comment |
---|---|---|---|---|
Capillary | OV-101 | 772. | Misharina and Golovnya, 1994 | He, 50. C @ 0. min, 4. K/min; Column length: 50. m; Column diameter: 0.32 mm; Tend: 200. C |
Capillary | SE-52 | 798. | Misharina and Golovnya, 1994 | 60. m/0.32 mm/2. μm, He, 50. C @ 0. min, 4. K/min; Tend: 200. C |

References

Conde-Caprace and Collin, 1972
Conde-Caprace, G.; Collin, J.E.,
Ionization and dissociation of cyclic ethers thioethers by electron-impact. A comparison between 1,3-dioxolane, 1,3-dithiolane and 1,3-oxathiolane,
Org. Mass Spectrom., 1972, 6, 415. [all data]