Butanal, 2,2-dimethyl-
- Formula: C6H12O
- Molecular weight: 100.1589
- IUPAC Standard InChIKey: QYPLKDUOPJZROX-UHFFFAOYSA-N
- CAS Registry Number: 2094-75-9
- Chemical structure:
View 3d structure (requires JavaScript / HTML 5) - Permanent link for this species. Use this link for bookmarking this species for future reference.

Phase change data

Data compiled by: Thermodynamics Research Center, NIST Boulder Laboratories, Chris Muzny director
Quantity | Value | Units | Method | Reference | Comment |
---|---|---|---|---|---|
Tboil | 376.15 | K | N/A | Brunner and Farmer, 1937 | Uncertainty assigned by TRC = 3. K |
Tboil | 378.4 | K | N/A | Kohlraush and Koppl, 1934 | Uncertainty assigned by TRC = 1.5 K |
Tboil | 377.15 | K | N/A | Conant, Webb, et al., 1929 | Uncertainty assigned by TRC = 2. K |

Gas phase ion energetics data

Data compiled as indicated in comments:
LBLHLM - Sharon G. Lias, John E. Bartmess, Joel F. Liebman, John L. Holmes, Rhoda D. Levin, and W. Gary Mallard
LLK - Sharon G. Lias, Rhoda D. Levin, and Sherif A. Kafafi
Appearance energy determinations
Ion | AE (eV) | Other Products | Method | Reference | Comment |
---|---|---|---|---|---|
C4H8O+ | 9.58 | C2H4 | EI | Holmes and Lossing, 1980 | LLK |
C5H11+ | 10.06 ± 0.05 | HCO | EI | Holmes and Lossing, 1984 | LBLHLM |

References

Brunner and Farmer, 1937
Brunner, H.; Farmer, E.H.,
Mechanism of polymerisation: I dimeric tetramethylethylene,
J. Chem. Soc., 1937, 1937, 1039. [all data]
Kohlraush and Koppl, 1934
Kohlraush, K.W.F.; Koppl, F.,
Z. Phys. Chem., Abt. B, 1934, 24, 370. [all data]
Conant, Webb, et al., 1929
Conant, J.B.; Webb, C.N.; Mendum, W.C.,
Trimethylacetaldehyde and dimethylethylacetaldehyde,
J. Am. Chem. Soc., 1929, 51, 1246. [all data]
Holmes and Lossing, 1980
Holmes, J.L.; Lossing, F.P.,
Gas-phase heats of formation of keto and enol ions of carbonyl compounds.,
J. Am. Chem. Soc., 1980, 102, 1591. [all data]
Holmes and Lossing, 1984
Holmes, J.L.; Lossing, F.P.,
Heats of formation of organic radicals from appearance energies,
Int. J. Mass Spectrom. Ion Processes, 1984, 58, 113. [all data]