Benzene,1-chloro-4-[(4-methoxyphenyl)thio]-
- Formula: C13H11ClOS
- Molecular weight: 250.744
- IUPAC Standard InChIKey: CRZNSNXESWNOEA-UHFFFAOYSA-N
- CAS Registry Number: 20912-69-0
- Chemical structure:
View 3d structure (requires JavaScript / HTML 5) - Permanent link for this species. Use this link for bookmarking this species for future reference.

Gas phase ion energetics data

Data compiled by: Sharon G. Lias, Rhoda D. Levin, and Sherif A. Kafafi
Ionization energy determinations
IE (eV) | Method | Reference |
---|---|---|
7.91 | CTS | Aloisi, Santini, et al., 1974 |

References

Aloisi, Santini, et al., 1974
Aloisi, G.G.; Santini, S.; Sorriso, S.,
Molecular complexes of substituted diphenyl sulphides with π acceptors. Charge transfer spectra and ionization potentials of the donors,
J. Chem. Soc. Faraday Trans. 1, 1974, 70, 1908. [all data]