Disulfur monoxide
- Formula: OS2
- Molecular weight: 80.129
- IUPAC Standard InChIKey: TXKMVPPZCYKFAC-UHFFFAOYSA-N
- CAS Registry Number: 20901-21-7
- Chemical structure:
View 3d structure (requires JavaScript / HTML 5) - Permanent link for this species. Use this link for bookmarking this species for future reference.

Gas phase thermochemistry data

Quantity | Value | Units | Method | Reference | Comment |
---|---|---|---|---|---|
ΔfH°gas | -56.48 | kJ/mol | Review | Chase, 1998 | Data last reviewed in September, 1965 |
Quantity | Value | Units | Method | Reference | Comment |
S°gas,1 bar | 266.89 | J/mol*K | Review | Chase, 1998 | Data last reviewed in September, 1965 |
Gas Phase Heat Capacity (Shomate Equation)
Cp° = A + B*t + C*t2 + D*t3 +
E/t2
H° − H°298.15= A*t + B*t2/2 +
C*t3/3 + D*t4/4 − E/t + F − H
S° = A*ln(t) + B*t + C*t2/2 + D*t3/3 −
E/(2*t2) + G
Cp = heat capacity (J/mol*K)
H° = standard enthalpy (kJ/mol)
S° = standard entropy (J/mol*K)
t = temperature (K) / 1000.
View plot Requires a JavaScript / HTML 5 canvas capable browser.
Temperature (K) | 298. to 6000. |
---|---|
A | 52.74890 |
B | 4.576460 |
C | -1.232311 |
D | 0.104897 |
E | -0.942963 |
F | -75.59880 |
G | 324.1110 |
H | -56.48400 |
Reference | Chase, 1998 |
Comment | Data last reviewed in September, 1965 |

Gas phase ion energetics data

Data evaluated as indicated in comments:
L - Sharon G. Lias
Data compiled as indicated in comments:
LL - Sharon G. Lias and Joel F. Liebman
LLK - Sharon G. Lias, Rhoda D. Levin, and Sherif A. Kafafi
RDSH - Henry M. Rosenstock, Keith Draxl, Bruce W. Steiner, and John T. Herron
B - John E. Bartmess
Quantity | Value | Units | Method | Reference | Comment |
---|---|---|---|---|---|
IE (evaluated) | 10.584 ± 0.005 | eV | N/A | N/A | L |
Electron affinity determinations
EA (eV) | Method | Reference | Comment |
---|---|---|---|
1.8770 ± 0.0080 | LPES | Nimlos and Ellison, 1986 | B |
Ionization energy determinations
IE (eV) | Method | Reference | Comment |
---|---|---|---|
10.584 ± 0.005 | PIPECO | Norwood and Ng, 1989 | LL |
10.58 ± 0.01 | PI | Berkowitz, Eland, et al., 1977 | LLK |
10.53 ± 0.02 | PE | Frost, Lee, et al., 1973 | LLK |
10.52 | PE | Bock, Solouki, et al., 1973 | LLK |
10.62 | PE | McDowell, 1972 | LLK |
10.3 ± 0.1 | EI | Hagemann, 1962 | RDSH |
10.52 | PE | Rosmus, Dacre, et al., 1974 | Vertical value; LLK |
Appearance energy determinations
Ion | AE (eV) | Other Products | Method | Reference | Comment |
---|---|---|---|---|---|
OS+ | 13.745 ± 0.006 | S | PI | Berkowitz, Eland, et al., 1977 | LLK |
SO+ | 14.5 ± 0.2 | S | EI | Hagemann, 1962 | RDSH |

Reaction thermochemistry data

Data compiled as indicated in comments:
B - John E. Bartmess
M - Michael M. Meot-Ner (Mautner) and Sharon G. Lias
Individual Reactions
By formula: F- + OS2 = (F- • OS2)
Quantity | Value | Units | Method | Reference | Comment |
---|---|---|---|---|---|
ΔrH° | 184. ± 13. | kJ/mol | IMRB | Larson and McMahon, 1987 | gas phase; These relative affinities are ca. 10 kcal/mol weaker than threshold values (see Wenthold and Squires, 1995) for donors greater than ca. 27 kcal/mol in free energy. This discrepancy has not yet been resolved, though the stronger value appears preferable.; B,M |
Quantity | Value | Units | Method | Reference | Comment |
ΔrG° | 155. ± 13. | kJ/mol | IMRB | Larson and McMahon, 1987 | gas phase; These relative affinities are ca. 10 kcal/mol weaker than threshold values (see Wenthold and Squires, 1995) for donors greater than ca. 27 kcal/mol in free energy. This discrepancy has not yet been resolved, though the stronger value appears preferable.; B |

Ion clustering data

Data compiled as indicated in comments:
B - John E. Bartmess
M - Michael M. Meot-Ner (Mautner) and Sharon G. Lias
Clustering reactions
By formula: F- + OS2 = (F- • OS2)
Quantity | Value | Units | Method | Reference | Comment |
---|---|---|---|---|---|
ΔrH° | 184. ± 13. | kJ/mol | IMRB | Larson and McMahon, 1987 | gas phase; These relative affinities are ca. 10 kcal/mol weaker than threshold values (see Wenthold and Squires, 1995) for donors greater than ca. 27 kcal/mol in free energy. This discrepancy has not yet been resolved, though the stronger value appears preferable.; B,M |
Quantity | Value | Units | Method | Reference | Comment |
ΔrG° | 155. ± 13. | kJ/mol | IMRB | Larson and McMahon, 1987 | gas phase; These relative affinities are ca. 10 kcal/mol weaker than threshold values (see Wenthold and Squires, 1995) for donors greater than ca. 27 kcal/mol in free energy. This discrepancy has not yet been resolved, though the stronger value appears preferable.; B |

Vibrational and/or electronic energy levels

Data compiled by: Marilyn E. Jacox
State: C
Energy (cm-1) |
Med. | Transition | λmin (nm) |
λmax (nm) |
References | ||
---|---|---|---|---|---|---|---|
To = 29687.72 | gas | C-X | 250 | 395 | Jones, 1950 | ||
Lakshminarayana, 1975 | |||||||
Hallin, Merer, et al., 1977 | |||||||
Chiu, Sung, et al., 1982 | |||||||
Tsukiyama, Kobayashi, et al., 1984 | |||||||
Clouthier and Rutherford, 1988 | |||||||
Zhang, Dupre, et al., 1995 | |||||||
Muller, Vaccaro, et al., 1999 | |||||||
To = 29285 ± 20 | Xe | C-X | 280 | 342 | Phillips, Smith, et al., 1969 | ||
Vib. sym. |
No. | Approximate type of mode |
cm-1 | Med. | Method | References | |
---|---|---|---|---|---|---|---|
a' | 1 | SO stretch | 1033.9 ± 0.6 | gas | AB LF | Hallin, Merer, et al., 1977 Tsukiyama, Kobayashi, et al., 1984 Clouthier and Rutherford, 1988 Muller, Vaccaro, et al., 1999 | |
2 | Bend | 253.8 ± 0.6 | gas | AB LF | Hallin, Merer, et al., 1977 Tsukiyama, Kobayashi, et al., 1984 Clouthier and Rutherford, 1988 Muller, Vaccaro, et al., 1999 | ||
3 | SS stretch | 410.6 | gas | AB LF | Lakshminarayana, 1975 Hallin, Merer, et al., 1977 Tsukiyama, Kobayashi, et al., 1984 Clouthier and Rutherford, 1988 Zhang, Dupre, et al., 1995 Muller, Vaccaro, et al., 1999 | ||
3 | SS stretch | 415 ± 20 | Xe | AB | Phillips, Smith, et al., 1969 | ||
State: a
Energy (cm-1) |
Med. | Transition | λmin (nm) |
λmax (nm) |
References | ||
---|---|---|---|---|---|---|---|
To = 13943 | gas | a-X | 430 | 670 | Dixon, Haner, et al., 1977 | ||
Tsukiyama, Kobayashi, et al., 1984 | |||||||
Clouthier, 1987 | |||||||
Vib. sym. |
No. | Approximate type of mode |
cm-1 | Med. | Method | References | |
---|---|---|---|---|---|---|---|
a' | 1 | SO stretch | 1089 | gas | AB | Dixon, Haner, et al., 1977 Clouthier, 1987 | |
2 | Bend | 332 | gas | AB | Dixon, Haner, et al., 1977 Clouthier, 1987 | ||
3 | SS stretch | 505 | gas | AB | Dixon, Haner, et al., 1977 Clouthier, 1987 | ||
State: X
Vib. sym. |
No. | Approximate type of mode |
cm-1 | Med. | Method | References | |
---|---|---|---|---|---|---|---|
a' | 1 | SO stretch | 1166.45 | gas | DL LF | Jones, 1950 Blukis and Myers, 1965 Lindemayer and Jones, 1985 Muller, Vaccaro, et al., 1999 | |
1 | SO stretch | 1157.6 | Ar | IR Ra | Hopkins, Daly, et al., 1975 Tang and Brown, 1975 Lo, Wu, et al., 2002 | ||
1 | SO stretch | 1155.0 | N2 | IR | Lo, Wu, et al., 2002 | ||
2 | Bend | 380 | gas | LF | Clouthier and Rutherford, 1988 Muller, Vaccaro, et al., 1999 | ||
2 | Bend | 370 ± 30 | gas | MW | Meschi and Myers, 1959 | ||
2 | Bend | 382 | Ar | IR Ra | Hopkins, Daly, et al., 1975 Tang and Brown, 1975 | ||
3 | SS stretch | 679.1 | gas | IR LF | Jones, 1950 Blukis and Myers, 1965 Tsukiyama, Kobayashi, et al., 1984 Muller, Vaccaro, et al., 1999 | ||
3 | SS stretch | 672.5 | Ar | IR Ra | Hopkins, Daly, et al., 1975 Tang and Brown, 1975 Lo, Wu, et al., 2002 | ||
3 | SS stretch | 675.1 | N2 | IR | Lo, Wu, et al., 2002 | ||
Additional references: Jacox, 1994, page 105; Jacox, 1998, page 199; Jacox, 2003, page 143; Cook, Winnewisser, et al., 1973; Tiemann, Hoeft, et al., 1974; Thorwirth, Theule, et al., 2006

References

Chase, 1998
Chase, M.W., Jr.,
NIST-JANAF Themochemical Tables, Fourth Edition,
J. Phys. Chem. Ref. Data, Monograph 9, 1998, 1-1951. [all data]
Nimlos and Ellison, 1986
Nimlos, M.R.; Ellison, G.B.,
Photoelectron spectroscopy of SO2-, S3-, and S2O-,
J. Phys. Chem., 1986, 90, 2574. [all data]
Norwood and Ng, 1989
Norwood, K.; Ng, C.Y.,
Photoion-photoelectron coincidence spectroscopy of the transient molecules SO and S2O,
Chem. Phys. Lett., 1989, 156, 145. [all data]
Berkowitz, Eland, et al., 1977
Berkowitz, J.; Eland, J.H.D.; Appelman, E.H.,
Photoionization mass spectrometry and heat of formation of S2O,
J. Chem. Phys., 1977, 66, 2183. [all data]
Frost, Lee, et al., 1973
Frost, D.C.; Lee, S.T.; McDowell, C.A.,
The HeI photoelectron spectrum of S2O,
Chem. Phys. Lett., 1973, 22, 243. [all data]
Bock, Solouki, et al., 1973
Bock, H.; Solouki, B.; Rosmus, P.; Steudel, R.,
Photoelectron spectra and molecular properties: SSO and OSO,
Angew. Chem. Int. Ed. Engl., 1973, 12, 933. [all data]
McDowell, 1972
McDowell, C.A.,
General disscussion,
Faraday Discuss. Chem. Soc., 1972, 54, 68. [all data]
Hagemann, 1962
Hagemann, R.,
Determination de la chaleur de formation de S2O par spectrometrie de masse,
Compt. Rend., 1962, 255, 1102. [all data]
Rosmus, Dacre, et al., 1974
Rosmus, P.; Dacre, P.D.; Solouki, B.; Bock, H.,
Hartree-Fock calculations photoelectron spectra of SSO NSF,
Theor. Chim. Acta, 1974, 35, 129. [all data]