Acenaphthylene
- Formula: C12H8
- Molecular weight: 152.1919
- IUPAC Standard InChIKey: HXGDTGSAIMULJN-UHFFFAOYSA-N
- CAS Registry Number: 208-96-8
- Chemical structure:
View 3d structure (requires JavaScript / HTML 5) - Other names: Cyclopenta[de]naphthalene; Acenaphthalene

Gas phase thermochemistry data

Data compiled as indicated in comments:
DRB - Donald R. Burgess, Jr.
ALS - Hussein Y. Afeefy, Joel F. Liebman, and Stephen E. Stein
GT - Glushko Thermocenter, Russian Academy of Sciences, Moscow
Quantity | Value | Units | Method | Reference | Comment |
---|---|---|---|---|---|
ΔfH°gas | 62.91 ± 0.88 | kcal/mol | Review | Roux, Temprado, et al., 2008 | There are sufficient literature values to make a qualified recommendation where the suggested value is in good agreement with values predicted using thermochemical cycles or from reliable estimates. In general, the evaluated uncertainty limits are on the order of (2 to 4) kJ/mol.; DRB |
ΔfH°gas | 63.10 | kcal/mol | N/A | Sadowska, 1966 | Value computed using ΔfHsolid° value of 193.0±4.0 kj/mol from Sadowska, 1966 and ΔsubH° value of 71.0 kj/mol from Boyd, Christensen, et al., 1965.; DRB |
ΔfH°gas | 61.7 ± 1.4 | kcal/mol | Ccb | Boyd, Christensen, et al., 1965 | ALS |
Constant pressure heat capacity of gas
Cp,gas (cal/mol*K) | Temperature (K) | Reference | Comment |
---|---|---|---|
8.454 | 50. | Dorofeeva O.V., 1989 | These statistically calculated values were obtained using force field approximation for polycyclic aromatic hydrocarbons to estimate the needed vibrational frequencies (see also [ Dorofeeva O.V., 1986, Moiseeva N.F., 1990]). These functions are reproduced in the reference book [ Frenkel M., 1994].; GT |
11.92 | 100. | ||
17.23 | 150. | ||
23.60 | 200. | ||
33.592 | 273.15 | ||
36.99 ± 0.24 | 298.15 | ||
37.242 | 300. | ||
49.885 | 400. | ||
60.390 | 500. | ||
68.781 | 600. | ||
75.488 | 700. | ||
80.920 | 800. | ||
85.385 | 900. | ||
89.097 | 1000. | ||
92.213 | 1100. | ||
94.847 | 1200. | ||
97.089 | 1300. | ||
99.008 | 1400. | ||
100.66 | 1500. |

Condensed phase thermochemistry data

Data compiled as indicated in comments:
DRB - Donald R. Burgess, Jr.
ALS - Hussein Y. Afeefy, Joel F. Liebman, and Stephen E. Stein
DH - Eugene S. Domalski and Elizabeth D. Hearing
Quantity | Value | Units | Method | Reference | Comment |
---|---|---|---|---|---|
ΔfH°solid | 45.60 ± 0.84 | kcal/mol | Review | Roux, Temprado, et al., 2008 | There are sufficient literature values to make a qualified recommendation where the suggested value is in good agreement with values predicted using thermochemical cycles or from reliable estimates. In general, the evaluated uncertainty limits are on the order of (2 to 4) kJ/mol.; DRB |
ΔfH°solid | 46.1 ± 1. | kcal/mol | Ccb | Sadowska, 1966 | ALS |
ΔfH°solid | 44.7 ± 1.1 | kcal/mol | Ccb | Boyd, Christensen, et al., 1965 | ALS |
Quantity | Value | Units | Method | Reference | Comment |
ΔcH°solid | -1448. ± 1. | kcal/mol | Ccb | Sadowska, 1966 | Corresponding ΔfHºsolid = 46.1 kcal/mol (simple calculation by NIST; no Washburn corrections); ALS |
ΔcH°solid | -1446.5 ± 1.1 | kcal/mol | Ccb | Boyd, Christensen, et al., 1965 | Corresponding ΔfHºsolid = 44.6 kcal/mol (simple calculation by NIST; no Washburn corrections); ALS |
Constant pressure heat capacity of solid
Cp,solid (cal/mol*K) | Temperature (K) | Reference | Comment |
---|---|---|---|
39.77 | 298. | Sadowska, Stepniewska, et al., 1969 | T = 20 to 89°C, equation only; liquid 90 to 150°C, equation only.; DH |

Phase change data

Data compiled as indicated in comments:
BS - Robert L. Brown and Stephen E. Stein
TRC - Thermodynamics Research Center, NIST Boulder Laboratories, Chris Muzny director
AC - William E. Acree, Jr., James S. Chickos
DRB - Donald R. Burgess, Jr.
ALS - Hussein Y. Afeefy, Joel F. Liebman, and Stephen E. Stein
DH - Eugene S. Domalski and Elizabeth D. Hearing
Quantity | Value | Units | Method | Reference | Comment |
---|---|---|---|---|---|
Tboil | 553.2 | K | N/A | Aldrich Chemical Company Inc., 1990 | BS |
Tboil | 538. to 548. | K | N/A | Buckingham and Donaghy, 1982 | BS |
Quantity | Value | Units | Method | Reference | Comment |
Tfus | 365. to 366. | K | N/A | Buckingham and Donaghy, 1982 | BS |
Tfus | 362.6 | K | N/A | Sadowska, Stepniewska, et al., 1969, 2 | Uncertainty assigned by TRC = 0.2 K; TRC |
Tfus | 366.4 | K | N/A | Boyd, Christensen, et al., 1965, 2 | Uncertainty assigned by TRC = 0.3 K; TRC |
Tfus | 365.7 | K | N/A | Sangster and Irvine, 1956 | Uncertainty assigned by TRC = 2. K; TRC |
Quantity | Value | Units | Method | Reference | Comment |
ΔvapH° | 15.4 ± 1.4 | kcal/mol | CGC | Roux, Temprado, et al., 2008, 2 | AC |
ΔvapH° | 16.5 ± 0.53 | kcal/mol | GC | Haftka, Parsons, et al., 2006 | AC |
Quantity | Value | Units | Method | Reference | Comment |
ΔsubH° | 17.2 ± 0.5 | kcal/mol | AVG | N/A | Average of 6 values; Individual data points |
Reduced pressure boiling point
Tboil (K) | Pressure (atm) | Reference | Comment |
---|---|---|---|
429. to 433. | 0.037 | Buckingham and Donaghy, 1982 | BS |
Enthalpy of sublimation
ΔsubH (kcal/mol) | Temperature (K) | Method | Reference | Comment |
---|---|---|---|---|
18.5 | 383. | GS | Nass, Lenoir, et al., 1995 | Based on data from 313. to 453. K.; AC |
17.5 ± 0.1 | 303. | GS | Sonnefeld, Zoller, et al., 1983 | Based on data from 238. to 323. K.; AC |
17.0 ± 0.31 | 286. to 318. | A | Cox and Pilcher, 1970 | See also Stephenson and Malanowski, 1987 and Boyd, Christensen, et al., 1965.; AC |
Enthalpy of fusion
ΔfusH (kcal/mol) | Temperature (K) | Reference | Comment |
---|---|---|---|
2.620 | 362. | Domalski and Hearing, 1996 | See also Cheda and Westrum, 1994.; AC |
1.659 | 362.6 | Sadowska, Stepniewska, et al., 1969 | DH |
Entropy of fusion
ΔfusS (cal/mol*K) | Temperature (K) | Reference | Comment |
---|---|---|---|
4.575 | 362.6 | Sadowska, Stepniewska, et al., 1969 | DH |

Reaction thermochemistry data

Data compiled by: Michael M. Meot-Ner (Mautner) and Sharon G. Lias
Individual Reactions
By formula: C6H7N+ + C12H8 = (C6H7N+ • C12H8)
Bond type: Charge transfer bond (positive ion)
Quantity | Value | Units | Method | Reference | Comment |
---|---|---|---|---|---|
ΔrH° | 17.2 | kcal/mol | PHPMS | Meot-Ner (Mautner) and El-Shall, 1986 | gas phase; Entropy change calculated or estimated |
Quantity | Value | Units | Method | Reference | Comment |
ΔrS° | 26. | cal/mol*K | N/A | Meot-Ner (Mautner) and El-Shall, 1986 | gas phase; Entropy change calculated or estimated |
Free energy of reaction
ΔrG° (kcal/mol) | T (K) | Method | Reference | Comment |
---|---|---|---|---|
8.7 | 325. | PHPMS | Meot-Ner (Mautner) and El-Shall, 1986 | gas phase; Entropy change calculated or estimated |

Gas phase ion energetics data

Data evaluated as indicated in comments:
L - Sharon G. Lias
Data compiled as indicated in comments:
MM - Michael M. Meot-Ner (Mautner)
LLK - Sharon G. Lias, Rhoda D. Levin, and Sherif A. Kafafi
RDSH - Henry M. Rosenstock, Keith Draxl, Bruce W. Steiner, and John T. Herron
B - John E. Bartmess
Quantity | Value | Units | Method | Reference | Comment |
---|---|---|---|---|---|
IE (evaluated) | 8.12 ± 0.10 | eV | N/A | N/A | L |
Electron affinity determinations
EA (eV) | Method | Reference | Comment |
---|---|---|---|
<0.403 ± 0.026 | ECD | Wojnarovits and Foldiak, 1981 | G3MP2B3 calculations indicate an EA of ca. 0.7 eV; B |
Proton affinity at 298K
Proton affinity (kcal/mol) | Reference | Comment |
---|---|---|
205.8 | Aue, Guidoni, et al., 2000 | Experimental literature data re-evaluated by the authors using ab initio protonation entropies; MM |
Gas basicity at 298K
Gas basicity (review) (kcal/mol) | Reference | Comment |
---|---|---|
199.0 | Aue, Guidoni, et al., 2000 | Experimental literature data re-evaluated by the authors using ab initio protonation entropies; MM |
Ionization energy determinations
IE (eV) | Method | Reference | Comment |
---|---|---|---|
8.22 ± 0.04 | PE | Boschi, Clar, et al., 1974 | LLK |
8.02 ± 0.01 | PE | Dewar, Haselbach, et al., 1970 | RDSH |

Ion clustering data

Data compiled by: Michael M. Meot-Ner (Mautner) and Sharon G. Lias
Clustering reactions
By formula: C6H7N+ + C12H8 = (C6H7N+ • C12H8)
Bond type: Charge transfer bond (positive ion)
Quantity | Value | Units | Method | Reference | Comment |
---|---|---|---|---|---|
ΔrH° | 17.2 | kcal/mol | PHPMS | Meot-Ner (Mautner) and El-Shall, 1986 | gas phase; Entropy change calculated or estimated |
Quantity | Value | Units | Method | Reference | Comment |
ΔrS° | 26. | cal/mol*K | N/A | Meot-Ner (Mautner) and El-Shall, 1986 | gas phase; Entropy change calculated or estimated |
Free energy of reaction
ΔrG° (kcal/mol) | T (K) | Method | Reference | Comment |
---|---|---|---|---|
8.7 | 325. | PHPMS | Meot-Ner (Mautner) and El-Shall, 1986 | gas phase; Entropy change calculated or estimated |

Kovats' RI, non-polar column, isothermal

Column type | Active phase | Temperature (C) | I | Reference | Comment |
---|---|---|---|---|---|
Capillary | DB-1 | 135. | 1424.62 | Vickers, Kuhn, et al., 2003 | 30. m/0.25 mm/0.25 μm, He |
Capillary | DB-1 | 170. | 1457.55 | Kuhn, 2001 | 30. m/0.53 mm/3. μm, He |
Capillary | OV-1 | 150. | 1495. | Zhang, Chen, et al., 1997 | 25. m/0.2 mm/0.33 μm, N2 |

Van Den Dool and Kratz RI, non-polar column, temperature ramp

Column type | Active phase | I | Reference | Comment |
---|---|---|---|---|
Capillary | OV-1 | 1460.0 | Gautzsch and Zinn, 1996 | 8. K/min; Tstart: 35. C; Tend: 300. C |
Capillary | DB-1 | 1408.9 | Farkas, Le Quere, et al., 1994 | 30. m/0.25 mm/0.25 μm, H2, 2. K/min; Tstart: 35. C; Tend: 259. C |
Capillary | Ultra-1 | 1409.0 | Farkas, Le Quere, et al., 1994 | 50. m/0.32 mm/0.52 μm, H2, 2. K/min; Tstart: 35. C; Tend: 259. C |
Capillary | DB-5 | 1456. | Rostad and Pereira, 1986 | 30. m/0.26 mm/0.25 μm, He, 50. C @ 4. min, 6. K/min, 300. C @ 20. min |
Capillary | SE-52 | 1426. | Beernaert, 1979 | He, 50. C @ 5. min, 6. K/min; Column length: 33.3 m; Column diameter: 0.50 mm; Tend: 320. C |
Capillary | SE-52 | 1425.03 | Lee, Vassilaros, et al., 1979 | 12. m/0.3 mm/0.34 μm, He, 2. K/min; Tstart: 50. C; Tend: 250. C |
Capillary | SE-52 | 1413. | Lee, Vassilaros, et al., 1979 | 12. m/0.28 mm/0.17 μm, He, 2. K/min; Tstart: 50. C; Tend: 250. C |

Van Den Dool and Kratz RI, non-polar column, custom temperature program

Column type | Active phase | I | Reference | Comment |
---|---|---|---|---|
Capillary | HP-1 | 1418.54 | Dimitriou-Christidis, Harris, et al., 2003 | 30. m/0.25 mm/0.25 μm; Program: 60C => 7C/min => 225C => 15C/min => 300C(11.43min) |
Capillary | HP-5 | 1453.37 | Dimitriou-Christidis, Harris, et al., 2003 | 30. m/0.25 mm/0.25 μm; Program: 60C => 7C/min => 225C => 15C/min => 300C(11.43min) |
Capillary | DB-5 | 1470. | Havenga and Rohwer, 1999 | 30. m/0.25 mm/0.25 μm, He; Program: 60 0C 7 0C/min -> 130 0C 5 0C/min -> 200 0C 6 0C/min -> 260 0C 20 0C/min -> 320 0C (4 min) |
Capillary | Methyl Silicone | 1419. | Oda, Ichikawa, et al., 1996 | Program: 50C (2min) => 20C/min => 160C => 5C/min => 210C => 10C/min => 300C |

Normal alkane RI, non-polar column, isothermal

Column type | Active phase | Temperature (C) | I | Reference | Comment |
---|---|---|---|---|---|
Capillary | OV-101 | 120. | 1428. | Nabivach and Gerasimenko, 1996 |

Normal alkane RI, non-polar column, temperature ramp

Column type | Active phase | I | Reference | Comment |
---|---|---|---|---|
Capillary | HP-5 | 1470. | Piyachaiseth, Jirapakkul, et al., 2011 | 60. m/0.25 mm/0.25 μm, Helium, 35. C @ 1. min, 10. K/min, 220. C @ 15. min |
Capillary | HP-5 MS | 1454. | Radulovic, Blagojevic, et al., 2010 | 30. m/0.25 mm/0.25 μm, Helium, 5. K/min, 290. C @ 10. min; Tstart: 70. C |
Capillary | HP-5 | 1450.7 | Leffingwell and Alford, 2005 | 60. m/0.32 mm/0.25 μm, He, 30. C @ 2. min, 2. K/min, 260. C @ 28. min |
Capillary | C103H208 | 1453. | Dumitrescu, Buda, et al., 2000 | H2, 5. K/min; Phase thickness: 0.25 μm; Tstart: 80. C; Tend: 275. C |
Capillary | C103H208 | 1455. | Dumitrescu, Buda, et al., 2000 | H2, 4. K/min; Phase thickness: 0.25 μm; Tstart: 100. C; Tend: 275. C |
Capillary | Ultra-1 | 1422. | Elizalde-González, Hutfliess, et al., 1996 | 50. m/0.2 mm/0.33 μm, H2, 3. K/min, 300. C @ 35. min; Tstart: 60. C |
Capillary | DB-5 | 1447. | Andersson and Weis, 1994 | 30. m/0.32 mm/0.25 μm, H2, 80. C @ 2. min, 4. K/min, 270. C @ 5. min |
Capillary | Ultra-1 | 1403. | Okumura, 1991 | 25. m/0.32 mm/0.25 μm, He, 3. K/min; Tstart: 80. C; Tend: 260. C |
Capillary | SE-54 | 1438. | Harland, Cumming, et al., 1986 | He, 50. C @ 2. min, 8. K/min, 250. C @ 12. min; Column length: 25. m; Column diameter: 0.32 mm |

Normal alkane RI, non-polar column, custom temperature program

Column type | Active phase | I | Reference | Comment |
---|---|---|---|---|
Capillary | SLB-5 MS | 1460. | Mondello, 2012 | 30. m/0.25 mm/0.25 μm, Helium; Program: not specified |
Capillary | SLB-5 MS | 1466. | Mondello, 2012 | 30. m/0.25 mm/0.25 μm, Helium; Program: not specified |
Capillary | Solgel-1 (SGE) | 1433. | SGE Co., 2008 | 30. m/0.25 mm/0.25 μm; Program: not specified |
Capillary | Solgel-1 (SGE) | 1434. | SGE Co., 2008 | 30. m/0.25 mm/0.25 μm; Program: not specified |
Capillary | Solgel-1 (SGE) | 1434. | SGE Co., 2008 | 30. m/0.25 mm/0.25 μm; Program: not specified |
Capillary | HP-5MS | 1483. | Vichi, Pizzale, et al., 2005 | 30. m/0.25 mm/0.25 μm; Program: 40C(3min) => 4C/min => 75C => 8C/min => 250C |
Capillary | CP-Sil5 CB MS | 1445. | Tirillini, Verdelli, et al., 2000 | 50. m/0.32 mm/0.4 μm; Program: 0C (3min) => 3C/min => 50C => 5C/min => 220C (30min) |

Normal alkane RI, polar column, temperature ramp

Column type | Active phase | I | Reference | Comment |
---|---|---|---|---|
Capillary | FFAP | 2193. | Piyachaiseth, Jirapakkul, et al., 2011 | 60. m/0.25 mm/0.25 μm, Helium, 45. C @ 1. min, 5. K/min, 220. C @ 5. min |

Normal alkane RI, polar column, custom temperature program

Column type | Active phase | I | Reference | Comment |
---|---|---|---|---|
Capillary | Supelcowax-10 | 2188. | Vichi, Pizzale, et al., 2005 | 30. m/0.25 mm/0.25 μm; Program: 40C(3min) => 4C/min => 75C => 8C/min => 250C |

Lee's RI, non-polar column, temperature ramp

Column type | Active phase | I | Reference | Comment |
---|---|---|---|---|
Capillary | PE-5 | 247.8 | Jamoussi, Kanzari, et al., 2007 | 20. m/0.18 mm/0.18 μm, 50. C @ 1.5 min, 8. K/min; Tend: 345. C |
Capillary | 5 % Phenyl methyl siloxane | 244.63 | Skrbic and Onjia, 2006 | 2. K/min; Tstart: 50. C; Tend: 250. C |
Capillary | 5 % Phenyl methyl siloxane | 247.40 | Skrbic and Onjia, 2006 | 80. C @ 2. min, 8. K/min, 300. C @ 10. min |
Capillary | HP-5 | 248.47 | Pedersen, Durant, et al., 2005 | 30. m/0.25 mm/0.25 μm, Helium, 50. C @ 1.5 min, 6. K/min, 310. C @ 10. min |
Capillary | DB-5MS | 248.88 | Chen, Keeran, et al., 2002 | 30. m/0.25 mm/0.5 μm, 40. C @ 1. min, 10. K/min; Tend: 310. C |
Capillary | DB-5MS | 248.48 | Chen, Keeran, et al., 2002 | 30. m/0.25 mm/0.5 μm, 40. C @ 1. min, 4. K/min; Tend: 310. C |
Capillary | PTE-5 | 248.29 | Wang, Jia, et al., 2000 | 30. m/0.25 mm/0.25 μm, 60. C @ 1.5 min, 8. K/min, 300. C @ 12.5 min |
Capillary | HP-5 | 247.93 | Piao, Chu, et al., 1999 | 30. m/0.25 mm/0.25 μm, 50. C @ 2. min, 4. K/min, 280. C @ 20. min |
Capillary | DB-5 | 245.4 | Durlak, Biswas, et al., 1998 | 30. m/0.25 mm/0.25 μm, 15. K/min; Tstart: 50. C; Tend: 300. C |
Capillary | DB-5 | 245.4 | Durlak, Biswas, et al., 1998 | 30. m/0.25 mm/0.25 μm, 15. K/min; Tstart: 50. C; Tend: 300. C |
Capillary | DB-5 | 249.0 | Durlak, Biswas, et al., 1998 | 30. m/0.25 mm/0.25 μm, 15. K/min; Tstart: 50. C; Tend: 300. C |
Capillary | HT-5 | 249.04 | Williams and Williams, 1998 | 40. C @ 8. min, 5. K/min, 400. C @ 20. min; Column length: 25. m; Column diameter: 0.32 mm |
Capillary | SE-52 | 245.83 | Wang, Peng, et al., 1997 | 4. K/min; Column length: 30. m; Column diameter: 0.30 mm; Tstart: 40. C; Tend: 250. C |
Capillary | SE-54 | 245.36 | Chen, 1996 | 4. K/min; Column length: 30. m; Column diameter: 0.25 mm; Tstart: 50. C; Tend: 300. C |
Capillary | DB-5 | 249.19 | Andersson and Weis, 1994 | 30. m/0.32 mm/0.25 μm, H2, 80. C @ 2. min, 4. K/min, 270. C @ 5. min |
Capillary | DB-5 | 248.9 | Donnelly, Abdel-Hamid, et al., 1993 | 30. m/0.32 mm/0.25 μm, He, 40. C @ 3. min, 8. K/min, 285. C @ 29.5 min |
Capillary | SE-54 | 247.82 | Guillén, Blanco, et al., 1989 | 20. m/0.22 mm/0.20 μm, He, 4. K/min; Tstart: 50. C; Tend: 300. C |
Capillary | DB-5 | 244.79 | Sye, Lin, et al., 1988 | 30. m/0.32 mm/0.25 μm, 80. C @ 1. min, 3. K/min; Tend: 290. C |
Capillary | DB-5 | 247.65 | Wise, Benner, et al., 1988 | 30. m/0.25 mm/0.25 μm, 40. C @ 2. min, 4. K/min, 280. C @ 5. min |
Capillary | SE-52 | 244.63 | Boenke and Ballschmiter, 1987 | Hydrogen, 3. K/min; Column length: 12. m; Tstart: 120. C; Tend: 285. C |
Capillary | DB-5 | 248.75 | Rostad and Pereira, 1986 | 30. m/0.26 mm/0.25 μm, He, 50. C @ 4. min, 6. K/min, 300. C @ 20. min |
Capillary | DB-5 | 243.59 | Tong, Centen, et al., 1985 | He, 4. K/min; Column length: 30. m; Column diameter: 0.25 mm; Tstart: 90. C; Tend: 325. C |
Capillary | DB-5 | 242.459 | Tong, Shore, et al., 1984 | He, 80. C @ 1. min, 3. K/min, 300. C @ 10. min; Column length: 30. m; Column diameter: 0.32 mm |
Capillary | SE-52 | 246.92 | Vassilaros, Kong, et al., 1982 | 20. m/0.30 mm/0.25 μm, H2, 40. C @ 2. min, 4. K/min; Tend: 265. C |
Capillary | SE-52 | 244.63 | Lee, Vassilaros, et al., 1979 | 12. m/0.3 mm/0.34 μm, He, 2. K/min; Tstart: 50. C; Tend: 250. C |

Lee's RI, non-polar column, custom temperature program

Column type | Active phase | I | Reference | Comment |
---|---|---|---|---|
Capillary | DB-5 | 249.2 | Fuentes, Font, et al., 2007 | Column length: 60. m; Program: not specified |
Capillary | HP-5MS | 248.27 | Wang, Li, et al., 2007 | 30. m/0.25 mm/0.25 μm, He; Program: 60C(2min) => 6C/min => 258C => 2C/min => 300C(4min) |
Capillary | HP-5MS | 247.65 | Wang, Li, et al., 2007, 2 | 30. m/0.25 mm/0.25 μm, He; Program: not specified |
Capillary | HP-5MS | 248.27 | Wang, Li, et al., 2007, 2 | 30. m/0.25 mm/0.25 μm, He; Program: not specified |
Capillary | DB-5MS | 249.2 | Aracil, Font, et al., 2005 | Column length: 60. m; Column diameter: 0.25 mm; Program: not specified |
Capillary | LM-5 | 240.45 | Ré-Poppi and Santiago-Silva, 2005 | 30. m/0.25 mm/0.25 μm, He; Program: 60C(2min) => 15C/min => 180C => 5C/min => 280C (10min) |
Capillary | LM-5 | 240.53 | Ré-Poppi and Santiago-Silva, 2005 | 30. m/0.25 mm/0.25 μm, He; Program: 60C(2min) => 15C/min => 180C => 5C/min => 280C (10min) |
Capillary | Ultra-1 | 244.6 | Sremac, Skrbic, et al., 2005 | 50. m/0.32 mm/0.50 μm, Nitrogen; Program: 40-100 0C 3-15 0C/min -> 290 0C |
Capillary | Ultra-1 | 247.4 | Sremac, Skrbic, et al., 2005 | 50. m/0.32 mm/0.50 μm, Nitrogen; Program: 40-100 0C 3-15 0C/min -> 290 0C |
Capillary | Ultra-1 | 247.7 | Sremac, Skrbic, et al., 2005 | 50. m/0.32 mm/0.50 μm, Nitrogen; Program: 40-100 0C 3-15 0C/min -> 290 0C |
Capillary | DB-5 | 247.4 | Lundstedt, Haglund, et al., 2003 | 30. m/0.25 mm/0.25 μm; Program: not specified |
Capillary | LM-5 | 240.52 | Ré-Poppi and Santiago-Silva, 2002 | 30. m/0.25 mm/0.25 μm, He; Program: 60C(2min) => 15C/min => 180C => 5C/min => 280C(5min) |
Capillary | LM-5 | 240.53 | Ré-Poppi and Santiago-Silva, 2002 | 30. m/0.25 mm/0.25 μm, He; Program: 60C(2min) => 15C/min => 180C => 5C/min => 280C(5min) |
Capillary | SE-52 | 244.63 | Wang, Peng, et al., 1997 | Column length: 30. m; Column diameter: 0.30 mm; Program: not specified |
Capillary | SE-54 | 244.63 | Chen, 1996 | Column length: 30. m; Column diameter: 0.25 mm; Program: not specified |
Capillary | SE-54 | 253.15 | Guillen, Iglesias, et al., 1992 | Program: not specified |
Capillary | DB-5 | 249.5 | Paschke, Herbel, et al., 1992 | 30. m/0.25 mm/0.25 μm, He; Program: 60 0C (3 min) 10 0C/min -> 100 0C (3 min) 5 0C/min -> 300 0C |
Capillary | OV-101 | 244.0 | Tucminen, Wickstrom, et al., 1986 | Program: not specified |
Capillary | DB-5 | 244.63 | Tong, Centen, et al., 1985 | He; Column length: 30. m; Column diameter: 0.25 mm; Program: not specified |
Lee's RI, polar column, temperature ramp
Column type | Active phase | I | Reference | Comment |
---|---|---|---|---|
Capillary | DB-Wax | 249.77 | Andersson and Weis, 1994 | 30. m/0.2 mm/0.15 μm, H2, 80. C @ 2. min, 4. K/min, 270. C @ 5. min |

References

Roux, Temprado, et al., 2008
Roux, M.V.; Temprado, M.; Chickos, J.S.; Nagano, Y.,
Critically Evaluated Thermochemical Properties of Polycyclic Aromatic Hydrocarbons,
J. Phys. Chem. Ref. Data, 2008, 37, 4, 1855-1996. [all data]
Sadowska, 1966
Sadowska, K.W.,
Cieplo tworzenia i uwodornienia acenaftylenu,
Przem. Chem., 1966, 45, 66-67. [all data]
Boyd, Christensen, et al., 1965
Boyd, R.H.; Christensen, R.L.; Pua, R.,
The heats of combustion of acenaphthene, acenaphthylene, and fluoranthene. Strain and delocalization in bridged naphthalenes,
J. Am. Chem. Soc., 1965, 87, 3554-3559. [all data]
Dorofeeva O.V., 1989
Dorofeeva O.V.,
Thermodynamic Properties of Gaseous Polycyclic Aromatic Hydrocarbons Containing Five-Membered Rings. Institute for High Temperatures, USSR Academy of Sciences, Preprint No.1-263 (in Russian), Moscow, 1989. [all data]
Dorofeeva O.V., 1986
Dorofeeva O.V.,
On calculation of thermodynamic properties of polycyclic aromatic hydrocarbons,
Thermochim. Acta, 1986, 102, 59-66. [all data]
Moiseeva N.F., 1990
Moiseeva N.F.,
Group additivity scheme for calculating the chemical thermodynamic properties of gaseous polycyclic aromatic hydrocarbons containing five-membered rings,
Thermochim. Acta, 1990, 168, 179-186. [all data]
Frenkel M., 1994
Frenkel M.,
Thermodynamics of Organic Compounds in the Gas State, Vol. I, II, Thermodynamics Research Center, College Station, Texas, 1994, 1994. [all data]
Sadowska, Stepniewska, et al., 1969
Sadowska, K.W.; Stepniewska, G.B.; Recko, W.M.,
Specific heat and enthalpy of fusion of acenaphthene and acenaphthylene,
Przem. Chem., 1969, 48, 282-285. [all data]
Aldrich Chemical Company Inc., 1990
Aldrich Chemical Company Inc.,
Catalog Handbook of Fine Chemicals, Aldrich Chemical Company, Inc., Milwaukee WI, 1990, 1. [all data]
Buckingham and Donaghy, 1982
Buckingham, J.; Donaghy, S.M.,
Dictionary of Organic Compounds: Fifth Edition, Chapman and Hall, New York, 1982, 1. [all data]
Sadowska, Stepniewska, et al., 1969, 2
Sadowska, K.W.; Stepniewska, G.B.; Recko, W.M.,
Specific heat and enthalpy of fusion of acenaphthene and acenaphthylene,
Przem. Chem., 1969, 48, 282. [all data]
Boyd, Christensen, et al., 1965, 2
Boyd, R.H.; Christensen, R.L.; Pua, R.,
The Heats of Combustion of Acenaphthene, Acenaphthylene, and Fluoranthene. Strain and Delocalization in Bridged Naphthalenes,
J. Am. Chem. Soc., 1965, 87, 3554. [all data]
Sangster and Irvine, 1956
Sangster, R.C.; Irvine, J.W.,
Study of Organic Scintillators,
J. Chem. Phys., 1956, 24, 670. [all data]
Roux, Temprado, et al., 2008, 2
Roux, Maria Victoria; Temprado, Manuel; Chickos, James S.; Nagano, Yatsuhisa,
Critically Evaluated Thermochemical Properties of Polycyclic Aromatic Hydrocarbons,
J. Phys. Chem. Ref. Data, 2008, 37, 4, 1855, https://doi.org/10.1063/1.2955570
. [all data]
Haftka, Parsons, et al., 2006
Haftka, Joris J.H.; Parsons, John R.; Govers, Harrie A.J.,
Supercooled liquid vapour pressures and related thermodynamic properties of polycyclic aromatic hydrocarbons determined by gas chromatography,
Journal of Chromatography A, 2006, 1135, 1, 91-100, https://doi.org/10.1016/j.chroma.2006.09.050
. [all data]
Nass, Lenoir, et al., 1995
Nass, Karen; Lenoir, Dieter; Kettrup, Antonius,
Calculation of the Thermodynamic Properties of Polycyclic Aromatic Hydrocarbons by an Incremental Procedure,
Angew. Chem. Int. Ed. Engl., 1995, 34, 16, 1735-1736, https://doi.org/10.1002/anie.199517351
. [all data]
Sonnefeld, Zoller, et al., 1983
Sonnefeld, W.J.; Zoller, W.H.; May, W.E.,
Dynamic coupled-column liquid-chromatographic determination of ambient-temperature vapor pressures of polynuclear aromatic hydrocarbons,
Anal. Chem., 1983, 55, 2, 275-280, https://doi.org/10.1021/ac00253a022
. [all data]
Cox and Pilcher, 1970
Cox, J.D.; Pilcher, G.,
Thermochemistry of Organic and Organometallic Compounds, Academic Press Inc., London, 1970, 643. [all data]
Stephenson and Malanowski, 1987
Stephenson, Richard M.; Malanowski, Stanislaw,
Handbook of the Thermodynamics of Organic Compounds, 1987, https://doi.org/10.1007/978-94-009-3173-2
. [all data]
Domalski and Hearing, 1996
Domalski, Eugene S.; Hearing, Elizabeth D.,
Heat Capacities and Entropies of Organic Compounds in the Condensed Phase. Volume III,
J. Phys. Chem. Ref. Data, 1996, 25, 1, 1, https://doi.org/10.1063/1.555985
. [all data]
Cheda and Westrum, 1994
Cheda, J.A.R.; Westrum, E.F., Jr.,
Subambient-temperature thermophysics of acenaphthene and acenaphthylene: molecular disorder in the latter,
J. Phys. Chem., 1994, 98, 2482-2488. [all data]
Meot-Ner (Mautner) and El-Shall, 1986
Meot-Ner (Mautner), M.; El-Shall, M.S.,
Ionic Charge Transfer Complexes. 1. Cationic Complexes with Delocalized and Partially Localized pi Systems,
J. Am. Chem. Soc., 1986, 108, 15, 4386, https://doi.org/10.1021/ja00275a026
. [all data]
Wojnarovits and Foldiak, 1981
Wojnarovits, L.; Foldiak, G.,
Electron capture detection of aromatic hydrocarbons,
J. Chromatogr. Sci., 1981, 206, 511. [all data]
Aue, Guidoni, et al., 2000
Aue, D.H.; Guidoni, M.; Betowski, L.D.,
Ab initio calculated gas-phase basicities of polynuclear aromatic hydrocarbons,
Int. J. Mass Spectrom., 2000, 201, 283. [all data]
Boschi, Clar, et al., 1974
Boschi, R.; Clar, E.; Schmidt, W.,
Photoelectron spectra of polynuclear aromatics. III. The effect of nonplanarity in sterically overcrowded aromatic hydrocarbons,
J. Chem. Phys., 1974, 60, 4406. [all data]
Dewar, Haselbach, et al., 1970
Dewar, M.J.S.; Haselbach, E.; Worley, S.D.,
Calculated and observed ionization potentials of unsaturated polycyclic hydrocarbons; calculated heats of formation by several semiempirical s.c.f. m.o. methods,
Proc. Roy. Soc. (London), 1970, A315, 431. [all data]
Vickers, Kuhn, et al., 2003
Vickers, A.K.; Kuhn, E.; Lautamo, R.,
A novel, inert, low bleed column for GC-MS, 2003, retrieved from http://www.chem.agilent.com/cag/cabu/gcapps.htm. [all data]
Kuhn, 2001
Kuhn, E.R.,
Selectivity vs. polarity: the fundamentals of chromatographic separation,
J. Sep. Sci., 2001, 24, 6, 473-476, https://doi.org/10.1002/1615-9314(20010601)24:6<473::AID-JSSC473>3.0.CO;2-Y
. [all data]
Zhang, Chen, et al., 1997
Zhang, M.; Chen, B.; Shen, S.; Chen, S.,
Compositional studies of high-temperature coal tar by g.c.-FT-i.r. analysis of middle oil fractions,
Fuel, 1997, 76, 5, 415-423, https://doi.org/10.1016/S0016-2361(97)85518-4
. [all data]
Gautzsch and Zinn, 1996
Gautzsch, R.; Zinn, P.,
Use of incremental models to estimate the retention indexes of aromatic compounds,
Chromatographia, 1996, 43, 3/4, 163-176, https://doi.org/10.1007/BF02292946
. [all data]
Farkas, Le Quere, et al., 1994
Farkas, P.; Le Quere, J.M.; Maarse, H.; Kovac, M.,
The standard GC retention index library of flavour compounds
in Trends in flavour research. Proceedings of the 7th Weurman Flavour Research Symposium, Maarse,H.; van der Heij,D.G., ed(s)., Weurman Flavour Research Symposium, Noordwijkerhout, Netherlands, 1994, 145-149. [all data]
Rostad and Pereira, 1986
Rostad, C.E.; Pereira, W.E.,
Kovats and Lee retention indices determined by gas chromatography/mass spectrometry for organic compounds of environmental interest,
J. Hi. Res. Chromatogr. Chromatogr. Comm., 1986, 9, 6, 328-334, https://doi.org/10.1002/jhrc.1240090603
. [all data]
Beernaert, 1979
Beernaert, H.,
Gas Chromatographic Analysis of Polyclylic Aromatic Hydrocarbons,
J. Chromatogr., 1979, 173, 1, 109-118, https://doi.org/10.1016/S0021-9673(01)80450-7
. [all data]
Lee, Vassilaros, et al., 1979
Lee, M.L.; Vassilaros, D.L.; White, C.M.; Novotny, M.,
Retention Indices for Programmed-Temperature Capillary-Column Gas Chromatography of Polycyclic Aromatic Hydrocarbons,
Anal. Chem., 1979, 51, 6, 768-773, https://doi.org/10.1021/ac50042a043
. [all data]
Dimitriou-Christidis, Harris, et al., 2003
Dimitriou-Christidis, P.; Harris, B.C.; McDonald, T.J.; Reese, E.; Autenrieth, R.L.,
Estimation of selected physicochemical properties for methylated naphthalene compounds,
Chemosphere, 2003, 52, 5, 869-881, https://doi.org/10.1016/S0045-6535(03)00288-1
. [all data]
Havenga and Rohwer, 1999
Havenga, W.J.; Rohwer, E.R.,
Chemical Characterization and Screening of Hydrocarbon Pollution in Industrial Soils by Headspace Solid-Phase Microextraction,
J. Chromatogr., 1999, 848, 1-2, 279-295, https://doi.org/10.1016/S0021-9673(99)00522-1
. [all data]
Oda, Ichikawa, et al., 1996
Oda, J.; Ichikawa, S.; Mori, T.,
Analysis of polycyclic aromatic hydrocarbons in airborne particulates by capillary GC/MS method with programmed temperature relative retention index,
Bunseki Kagaku, 1996, 45, 9, 825-835, https://doi.org/10.2116/bunsekikagaku.45.825
. [all data]
Nabivach and Gerasimenko, 1996
Nabivach, V.M.; Gerasimenko, V.A.,
Gas chromatographic retention characteristics of bicyclic aromatic hydrocarbons,
Coke and Chemistry (Rus), 1996, 6, 27-31. [all data]
Piyachaiseth, Jirapakkul, et al., 2011
Piyachaiseth, T.; Jirapakkul, W.; Chaiseri, S.,
Aroma compounds of flash-fried rice,
Kasetsart J. (Nat. Sci.), 2011, 45, 717-729. [all data]
Radulovic, Blagojevic, et al., 2010
Radulovic, N.; Blagojevic, P.; Palic, R.,
Comparative study of the leaf volatiles of Arctostaphylos uva-ursi (L.) Spreng. and Vaccinium vitis-idaea L. (Ericaceae),
Molecules, 2010, 15, 9, 6168-6185, https://doi.org/10.3390/molecules15096168
. [all data]
Leffingwell and Alford, 2005
Leffingwell, J.C.; Alford, E.D.,
Volatile constituents of Perique tobacco,
Electron. J. Environ. Agric. Food Chem., 2005, 4, 2, 899-915. [all data]
Dumitrescu, Buda, et al., 2000
Dumitrescu, V.; Buda, W.; Medvedovici, A.,
Evaluation of new stationary phases for capillary gas chromatography,
Rev. Roum. Chim., 2000, 45, 4, 313-318. [all data]
Elizalde-González, Hutfliess, et al., 1996
Elizalde-González, M.P.; Hutfliess, M.; Hedden, K.,
Retention index system, adsorption characteristics, and sructure correlations of polycyclic aromatic hydrocarbons in fuels,
J. Hi. Res. Chromatogr., 1996, 19, 6, 345-352, https://doi.org/10.1002/jhrc.1240190608
. [all data]
Andersson and Weis, 1994
Andersson, J.T.; Weis, U.,
Gas Chromatographic Determination of Polycyclic Aromatic Compounds with Fluorinated Analogues as Internal Standards,
J. Chromatogr. A, 1994, 659, 1, 151-161, https://doi.org/10.1016/0021-9673(94)85017-8
. [all data]
Okumura, 1991
Okumura, T.,
retention indices of environmental chemicals on methyl silicone capillary column,
Journal of Environmental Chemistry (Japan), 1991, 1, 2, 333-358, https://doi.org/10.5985/jec.1.333
. [all data]
Harland, Cumming, et al., 1986
Harland, B.J.; Cumming, R.I.; Gillings, E.,
The Kovats indexes of some organic micropollutants on an SE54 capillary column,
EUR, I Org. Micropollut. Aquat. Environ., 1986, EUR 10388, 123-127. [all data]
Mondello, 2012
Mondello, L.,
HS-SPME-GCxGC-MS analysis of Yerba Mate (Ilex paraguariensis)
in Shimadzu GC-GC application compendium of comprehensive 2D GC, Vol. 1-5, Shimadzu Corp., 2012, 1-29. [all data]
SGE Co., 2008
SGE Co.,
The Importance of Low Bleed Columns for GC-MS; Technical Article, The Importance of Low Bleed Columns for GC-MS, SGE Co., 2008, 2, retrieved from http://www.sge-com. [all data]
Vichi, Pizzale, et al., 2005
Vichi, S.; Pizzale, L.; Conte, L.S.; Buxaderas, S.; L´opez-Tamames, E.,
Simultaneous determination of volatile and semi-volatile aromatic hydrocarbons in virgin olive oil by headspace solid-phase microextraction coupled to gas chromatography/mass spectrometry,
J. Chromatogr. A, 2005, 1090, 1-2, 146-154, https://doi.org/10.1016/j.chroma.2005.07.007
. [all data]
Tirillini, Verdelli, et al., 2000
Tirillini, B.; Verdelli, G.; Paolocci, F.; Ciccioli, P.; Frattoni, M.,
The volatile organic compounds from the mycelium of Tuber borchii Vitt.,
Phytochemistry, 2000, 55, 8, 983-985, https://doi.org/10.1016/S0031-9422(00)00308-3
. [all data]
Jamoussi, Kanzari, et al., 2007
Jamoussi, B.; Kanzari, F.; Hassine, B.B.; Abderrabba, A.,
Using Bezier curves for the calculation of retention indices of polycyclic aromatic hydrocarbons in the so-called Lee's scale in temperature-programmed gas chromatography with mass spectrometry detection,
J. Chromatogr. Sci., 2007, 45, 1, 22-27, https://doi.org/10.1093/chromsci/45.1.22
. [all data]
Skrbic and Onjia, 2006
Skrbic, B.; Onjia, A.,
Prediction of Lee Retention Indices of Polycyclic Aromatic Hydrocarbons by Artificial Neural Networks,
J. Chromatorg. A, 2006, 1108, 2, 279-284, https://doi.org/10.1016/j.chroma.2006.01.080
. [all data]
Pedersen, Durant, et al., 2005
Pedersen, D.U.; Durant, J.L.; Taghizadeh, K.; Hemond, H.F.; Lafleur, A.L.; Cass, G.R.,
Human cell mutagenes in respirable airborne particles from the Northeastern United States. 2. Quantification of mutagenes and other organic compounds.,
Environ. Sci. Technol., 2005, 39, 24, 9547-9560, https://doi.org/10.1021/es050886c
. [all data]
Chen, Keeran, et al., 2002
Chen, P.H.; Keeran, W.S.; Van Ausdale, W.A.; Schindler, D.R.; Roberts, D.W.,
Application of Lee retention indices to the confirmation of tentatively identified compounds from GC/MS analysis of environmental samples, Technical paper, Analytical Services Division, Environmental ScienceEngineering, Inc, PO Box 1703, Gainesville, FL 32602, 2002, 11. [all data]
Wang, Jia, et al., 2000
Wang, J.; Jia, C.R.; Wong, C.K.; Wong, P.K.,
Characterization of polycyclic aromatic hydrocarbons created in lubricating oils,
Water Air Soil Poll., 2000, 120, 3/4, 381-396, https://doi.org/10.1023/A:1005251618062
. [all data]
Piao, Chu, et al., 1999
Piao, M.; Chu, S.; Zheng, M.; Xu, X.,
Characterization of the combustion products of polyethylene,
Chemosphere, 1999, 39, 9, 1497-1512, https://doi.org/10.1016/S0045-6535(99)00054-5
. [all data]
Durlak, Biswas, et al., 1998
Durlak, S.K.; Biswas, P.; Shi, J.; Bernhard, M.J.,
Characterization of polycyclic aromatic hydrocarbon particulate and gaseous emissions from polystyrene combustion,
Environ. Sci. Technol., 1998, 32, 15, 2301-2307, https://doi.org/10.1021/es9709031
. [all data]
Williams and Williams, 1998
Williams, P.T.; Williams, E.A.,
Recycling plastic waste by pyrolysis,
J. Inst. Energy, 1998, 71, 81-93. [all data]
Wang, Peng, et al., 1997
Wang, Y.; Peng, P.; Cui, S.; Zhang, Y.,
Identification of PAH in the Suzhou River bed sediments by GC/MS and PAH retention index system,
J. Nanjing Norm. Univ. (Nat. Sci.), 1997, 20, 2, 47-68. [all data]
Chen, 1996
Chen, J.,
GC and GC/MS methods for the analysis of polycyclic aromatic hydrocarbon (PAH) in sediment of the grand canal of China,
Toxicol. Environ. Chem., 1996, 54, 1-4, 69-73, https://doi.org/10.1080/02772249609358297
. [all data]
Donnelly, Abdel-Hamid, et al., 1993
Donnelly, J.R.; Abdel-Hamid, M.S.; Jeter, J.L.; Gurka, D.F.,
Application of gas chromatographic retention properties to the identification of environmental contaminants,
J. Chromatogr., 1993, 642, 1-2, 409-415, https://doi.org/10.1016/0021-9673(93)80106-I
. [all data]
Guillén, Blanco, et al., 1989
Guillén, M.D.; Blanco, J.; Bermejo, J.; Blanco, C.G.,
Temperature programmed retention indices of some PAHs on Capillary columns coated with OV-1701 and SE-54,
J. Hi. Res. Chromatogr., 1989, 12, 8, 552-554, https://doi.org/10.1002/jhrc.1240120816
. [all data]
Sye, Lin, et al., 1988
Sye, W.-F.; Lin, C.-L.; Yen, D.-P.; Tsai, C.-S.,
Polycyclic aromatic-hydrocarbons formation from luel and additives combustion,
J. Chinese Chem. Soc., 1988, 35, 1, 1-11. [all data]
Wise, Benner, et al., 1988
Wise, S.A.; Benner, B.A.; Byrd, G.D.; Chesler, S.N.; Rebbert, R.E.; Schantz, M.M.,
Determination of polycyclic aromatic hydrocarbons in a coal tar standard reference material,
Anal. Chem., 1988, 60, 9, 887-894, https://doi.org/10.1021/ac00160a012
. [all data]
Boenke and Ballschmiter, 1987
Boenke, A.; Ballschmiter, K.,
Fused quinones as retention index marker in high resolution gas chromatography with electron-capture detection (HRGC/ECD) of oxidized aromatic compounds,
Fresenius J. Anal. Chem., 1987, 327, 1, 44-45, https://doi.org/10.1007/BF00474554
. [all data]
Tong, Centen, et al., 1985
Tong, H.Y.; Centen, J.D.; Karasek, F.W.; Jellum, E.; Helland, P.,
Identification of Trace Organic Compounds in Dimethyl Sulphoxide Solution Using High-Performance Liquid Chromatography and Gas Chromatography-Mass Spectrometry,
J. Chromatogr., 1985, 324, 373-383, https://doi.org/10.1016/S0021-9673(01)81336-4
. [all data]
Tong, Shore, et al., 1984
Tong, H.Y.; Shore, D.L.; Karasek, F.W.; Helland, P.; Jellum, E.,
Identification of organic compounds obtained from incineration of municipal waste by high-performance liquid chromatographic fractionation and gas chromatography-mass spectrometry,
J. Chromatogr., 1984, 285, 423-441, https://doi.org/10.1016/S0021-9673(01)87784-0
. [all data]
Vassilaros, Kong, et al., 1982
Vassilaros, D.L.; Kong, R.C.; Later, D.W.; Lee, M.L.,
Linear retention index system for polycyclic aromatic compounds. Critical evaluation and additional indices,
J. Chromatogr., 1982, 252, 1-20, https://doi.org/10.1016/S0021-9673(01)88394-1
. [all data]
Fuentes, Font, et al., 2007
Fuentes, M.J.; Font, R.; Gomez-Rico, M.F.; Martin-Gullon, I.,
Pyrolysis and combustion of waste lubricant oil from diesel cars: Decomposition and pollutants,
J. Anal. Appl. Pyrolysis, 2007, 79, 1-2, 215-226, https://doi.org/10.1016/j.jaap.2006.12.004
. [all data]
Wang, Li, et al., 2007
Wang, Z.; Li, K.; Lambert, P.; Yang, C.,
Identification, characterization and quantitation of pyrogenic polycylic aromatic hydrocarbons and other organic compounds in tire fire products,
J. Chromatogr. A, 2007, 1139, 1, 14-26, https://doi.org/10.1016/j.chroma.2006.10.085
. [all data]
Wang, Li, et al., 2007, 2
Wang, Z.; Li, K.; Lambert, P.; Brown, C.E.; Yang, C.; Hollebone, B.P.,
Identification and characterization of polycyclic aromatic compounds in tire fire products and differentiation of pyrogenic PAHs from petrogenic PAHs
in Proceedings of the 30th Arctic and Marine Oilspill (AMOP) Technical Seminar. Vol.1, 2007, 61-85. [all data]
Aracil, Font, et al., 2005
Aracil, I.; Font, R.; Conesa, J.A.,
Semivolatile and volatile compounds from the pyrolysis and combustion of polyvinyl chloride,
J. Anal. Appl. Pyrolysis, 2005, 74, 1-2, 465-478, https://doi.org/10.1016/j.jaap.2004.09.008
. [all data]
Ré-Poppi and Santiago-Silva, 2005
Ré-Poppi, N.; Santiago-Silva, M.,
Polycyclic aromatic hydrocarbons and other selected organic compounds in ambient air of Campo Grande City, Brazil,
Atmos. Environ., 2005, 39, 16, 2839-2850, https://doi.org/10.1016/j.atmosenv.2004.10.006
. [all data]
Sremac, Skrbic, et al., 2005
Sremac, S.; Skrbic, B.; Onjia, A.,
Artificial neural network prediction of quantitative structure-retention relationships of polycyclic aromatic hydrocarbons in gas chromatography,
J. Serb. Chem. Soc., 2005, 70, 11, 1291-1300, https://doi.org/10.2298/JSC0511291S
. [all data]
Lundstedt, Haglund, et al., 2003
Lundstedt, S.; Haglund, P.; Öberg, L.,
Degradation and formation of polycyclic aromatic compounds during bioslurry treatment of an aged gasworks soil,
Environ. Toxicol. Chem., 2003, 22, 7, 1413-1420, https://doi.org/10.1002/etc.5620220701
. [all data]
Ré-Poppi and Santiago-Silva, 2002
Ré-Poppi, N.; Santiago-Silva, M.R.,
Identification of polycyclic aromatic hydrocarbons and methoxylated phenols in wood smoke emitted during production of charcoal,
Chromatographia, 2002, 55, 7/8, 475-481, https://doi.org/10.1007/BF02492280
. [all data]
Guillen, Iglesias, et al., 1992
Guillen, M.D.; Iglesias, M.J.; Dominguez, A.; Blanco, C.G.,
Polynuclear aromatic hydrocarbon retention indices on SE-54 stationary phase of the volatile components of a coal tar pitch. Relationships between chromatographic retention and thermal reactivity,
J. Chromatogr., 1992, 591, 1-2, 287-295, https://doi.org/10.1016/0021-9673(92)80246-Q
. [all data]
Paschke, Herbel, et al., 1992
Paschke, A.; Herbel, W.; Steinhart, H.; Franke, S.; Francke, W.,
Determination of mono- to tetracyclic aromatic hydrocarbons in lubricating oil,
J. Hi. Res. Chromatogr., 1992, 15, 12, 827-833, https://doi.org/10.1002/jhrc.1240151211
. [all data]
Tucminen, Wickstrom, et al., 1986
Tucminen, A.; Wickstrom, K.; Pyysalo, H.,
Determination of Polycyclic Aromatic Compounds by GLC-Selected Ion Monitoring (SIM) Technique,
J. Hi. Res. Chromatogr. Chromatogr. Comm., 1986, 9, 8, 469-471, https://doi.org/10.1002/jhrc.1240090813
. [all data]