Benzene,1-butyl-3-methoxy-
- Formula: C11H16O
- Molecular weight: 164.2441
- IUPAC Standard InChIKey: MBSSCIJIRKKVFU-UHFFFAOYSA-N
- CAS Registry Number: 20893-43-0
- Chemical structure:
View 3d structure (requires JavaScript / HTML 5) - Permanent link for this species. Use this link for bookmarking this species for future reference.

Gas phase ion energetics data

Data compiled by: Sharon G. Lias, Rhoda D. Levin, and Sherif A. Kafafi
Ionization energy determinations
IE (eV) | Method | Reference |
---|---|---|
8.2 ± 0.1 | EI | Lightner, Majeti, et al., 1972 |
Appearance energy determinations
Ion | AE (eV) | Other Products | Method | Reference | Comment |
---|---|---|---|---|---|
C8H9O+ | 12.0 ± 0.1 | ? | EI | Lightner, Majeti, et al., 1972 | |
C8H10O+ | 10.5 ± 0.1 | CH2=CHCH3 | EI | Lightner, Majeti, et al., 1972 |

References

Lightner, Majeti, et al., 1972
Lightner, D.A.; Majeti, S.; Nicoletti, R.; Thommen, E.,
Benzyl vs. tropylium ions in the electron impact induced decomposition of n- butylbenzenes,
Intra-Sci. Chem. Rep., 1972, 6, 113. [all data]