Naphthalene, 2-(epoxyethyl)-
- Formula: C12H10O
- Molecular weight: 170.2072
- IUPAC Standard InChIKey: LAGFFQGUWPDQNH-UHFFFAOYSA-N
- CAS Registry Number: 20861-99-8
- Chemical structure:
View 3d structure (requires JavaScript / HTML 5) - Permanent link for this species. Use this link for bookmarking this species for future reference.

Gas phase ion energetics data

Data compiled by: Sharon G. Lias, Rhoda D. Levin, and Sherif A. Kafafi
Ionization energy determinations
IE (eV) | Method | Reference | Comment |
---|---|---|---|
8.21 | PE | Akiyama, Li, et al., 1979 | Vertical value |

References

Akiyama, Li, et al., 1979
Akiyama, I.; Li, K.C.; LeBreton, P.R.; Fu, P.P.; Harvey, R.G.,
Ultraviolet photoelectron studies of polycyclic aromatic hydrocarbons. The ground-state electronic structure of aryloxiranes and metabolites of benzo[a]pyrene,
J. Phys. Chem., 1979, 83, 2997. [all data]