2,2-Dimethylindene, 2,3-dihydro-
- Formula: C11H14
- Molecular weight: 146.2289
- IUPAC Standard InChIKey: VAMWEVQXIHGFHY-UHFFFAOYSA-N
- CAS Registry Number: 20836-11-7
- Chemical structure:
View 3d structure (requires JavaScript / HTML 5) - Other names: 1H-Indene,2,3-dihydro-2,2-dimethyl-

Gas phase ion energetics data

Data compiled as indicated in comments:
RDSH - Henry M. Rosenstock, Keith Draxl, Bruce W. Steiner, and John T. Herron
Ionization energy determinations
IE (eV) | Method | Reference | Comment |
---|---|---|---|
8.47 | CTS | Pitt, 1970 | RDSH |

References

Pitt, 1970
Pitt, C.G.,
Hyperconjugation: An alternative to the concept of the pπ-dπ bond in Group IV chemistry,
J. Organomet. Chem., 1970, 23, 35. [all data]