2-Thiophenebutanoic acid, methyl ester
- Formula: C9H12O2S
- Molecular weight: 184.255
- IUPAC Standard InChIKey: FUTXOYOSYBCRBT-UHFFFAOYSA-N
- CAS Registry Number: 20828-66-4
- Chemical structure:
View 3d structure (requires JavaScript / HTML 5) - Other names: Methyl 4-(2-thienyl)butanoate; 4-(2-Thienyl)butanoic acid methyl ester

Gas phase ion energetics data

Data compiled by: Henry M. Rosenstock, Keith Draxl, Bruce W. Steiner, and John T. Herron
Ionization energy determinations
IE (eV) | Method | Reference |
---|---|---|
8.4 ± 0.3 | EI | Howe and Williams, 1968 |
Appearance energy determinations
Ion | AE (eV) | Other Products | Method | Reference | Comment |
---|---|---|---|---|---|
C5H5S+ | 13.3 ± 0.2 | ? | EI | Howe, Williams, et al., 1969 | |
C6H6S+ | 10.7 ± 0.2 | ? | EI | Howe, Williams, et al., 1969 | |
C8H9OS+ | 11.1 ± 0.3 | CH3O | EI | Howe and Williams, 1968 |

References

Howe and Williams, 1968
Howe, I.; Williams, D.H.,
Studies in mass spectrometry. XXX. Substituent effects in mass spectrometry. Comparison of charge localization and quasi-equilibrium theories,
J. Am. Chem. Soc., 1968, 90, 5461. [all data]
Howe, Williams, et al., 1969
Howe, I.; Williams, D.H.; Kingston, D.G.I.; Tannenbaum, H.P.,
Substituent effects in the mass spectra of some - and -substituted methyl butyrates,
J. Chem. Soc. B, 1969, 439. [all data]