2(3H)-Furanone
- Formula: C4H4O2
- Molecular weight: 84.0734
- IUPAC Standard InChIKey: RHDGNLCLDBVESU-UHFFFAOYSA-N
- CAS Registry Number: 20825-71-2
- Chemical structure:
View 3d structure (requires JavaScript / HTML 5) - Other names: α-Crotonolactone; α-Furanone; δ,β,γ-Butenolide; 3-Butenoic acid, 4-hydroxy-, γ-lactone; 2-Oxo-2,3-dihydrofuran; β,γ-Crotonolactone; 2-Furanone

Gas phase ion energetics data

Data compiled by: Sharon G. Lias, Rhoda D. Levin, and Sherif A. Kafafi
Ionization energy determinations
IE (eV) | Method | Reference | Comment |
---|---|---|---|
10.70 | PE | Bain and Frost, 1973 | Vertical value |

Van Den Dool and Kratz RI, polar column, temperature ramp

Column type | Active phase | I | Reference | Comment |
---|---|---|---|---|
Capillary | DB-Wax | 1726. | Shiratsuchi, Shimoda, et al., 1993 | 60. m/0.25 mm/0.25 μm, 50. C @ 4. min, 2. K/min, 230. C @ 30. min |

Van Den Dool and Kratz RI, polar column, custom temperature program

Column type | Active phase | I | Reference | Comment |
---|---|---|---|---|
Capillary | Stabilwax | 1760. | Natali N., Chinnici F., et al., 2006 | 30. m/0.25 mm/0.25 μm, He; Program: 40C => 3C/min => 100C => 5C/min => 240C(10min) |

Normal alkane RI, non-polar column, temperature ramp

Column type | Active phase | I | Reference | Comment |
---|---|---|---|---|
Capillary | DB-1 | 914. | Lu, Yu, et al., 1997 | 60. m/0.32 mm/1. μm, He, 40. C @ 2. min, 2. K/min, 280. C @ 40. min |

References

Bain and Frost, 1973
Bain, A.D.; Frost, D.C.,
Studies of the carbonyl group in some five-membered ring compounds by photoelectron spectroscopy,
Can. J. Chem., 1973, 51, 1245. [all data]
Shiratsuchi, Shimoda, et al., 1993
Shiratsuchi, H.; Shimoda, M.; Minegishi, Y.; Osajima, Y.,
Isolation and identification of volatile flavor compounds in nonfermented coarse-cut sausage. Flavor as a quality factor of nonfermented sausage. 1,
J. Agric. Food Chem., 1993, 41, 4, 647-652, https://doi.org/10.1021/jf00028a027
. [all data]
Natali N., Chinnici F., et al., 2006
Natali N.; Chinnici F.; Riponi C.,
Characterization of volatiles in extracts from oak chips obtained by accelerated solvent extraction (ASE),
J. Agric. Food Chem., 2006, 54, 21, 8190-8198, https://doi.org/10.1021/jf0614387
. [all data]
Lu, Yu, et al., 1997
Lu, G.; Yu, T.-H.; Ho, C.-T.,
Generation of flavor compounds by the reaction of 2-deoxyglucose with selected amino acids,
J. Agric. Food Chem., 1997, 45, 1, 233-236, https://doi.org/10.1021/jf960609c
. [all data]