1,3-Dithiolan-2-one
- Formula: C3H4OS2
- Molecular weight: 120.193
- IUPAC Standard InChIKey: ZBEWVJOWXJNDGJ-UHFFFAOYSA-N
- CAS Registry Number: 2080-58-2
- Chemical structure:
View 3d structure (requires JavaScript / HTML 5) - Other names: 1,3-Dithiacyclopentane-2-one

Gas phase thermochemistry data

Data compiled by: Hussein Y. Afeefy, Joel F. Liebman, and Stephen E. Stein
Quantity | Value | Units | Method | Reference | Comment |
---|---|---|---|---|---|
ΔfH°gas | -125.9 ± 5.1 | kJ/mol | Ccb | Rauh and Geiseler, 1973 | Reanalyzed by Cox and Pilcher, 1970, Original value = -126. ± 5.0 kJ/mol |

Condensed phase thermochemistry data

Data compiled by: Hussein Y. Afeefy, Joel F. Liebman, and Stephen E. Stein
Quantity | Value | Units | Method | Reference | Comment |
---|---|---|---|---|---|
ΔcH°solid | -2751. ± 5.0 | kJ/mol | Ccb | Rauh and Geiseler, 1973 |

Phase change data

Data compiled by: Hussein Y. Afeefy, Joel F. Liebman, and Stephen E. Stein
Quantity | Value | Units | Method | Reference | Comment |
---|---|---|---|---|---|
ΔsubH° | 80.3 ± 0.4 | kJ/mol | V | Rauh and Geiseler, 1973 |

Gas phase ion energetics data

Data compiled as indicated in comments:
LLK - Sharon G. Lias, Rhoda D. Levin, and Sherif A. Kafafi
Ionization energy determinations
IE (eV) | Method | Reference | Comment |
---|---|---|---|
9.58 | PE | Wittel, Astrup, et al., 1975 | Vertical value; LLK |
9.50 | PE | Guimon and Pfister-Guillouzo, 1975 | Vertical value; LLK |

References

Rauh and Geiseler, 1973
Rauh, V.H.J.; Geiseler, G.,
Bildungsenthalpien und mesomerieenergien von π-bindungssystemen. 6. Mitteilung: Zur stabilität der isotrithione und isodithione,
Z. Phys. Chem. (Leipzig), 1973, 252, 395-397. [all data]
Cox and Pilcher, 1970
Cox, J.D.; Pilcher, G.,
Thermochemistry of Organic and Organometallic Compounds, Academic Press, New York, 1970, 1-636. [all data]
Wittel, Astrup, et al., 1975
Wittel, K.; Astrup, E.E.; Bock, H.; Graeffe, G.; Juslen, H.,
Photoelectron spectra and molecular properties, XLVIII Carbonates thio- carbonates,
Z. Naturforsch. B:, 1975, 30, 862. [all data]
Guimon and Pfister-Guillouzo, 1975
Guimon, C.; Pfister-Guillouzo, G.,
Electronic structure of sulfur compounds XVI. Photoelectron spectra of ethylene trithiocarbonate ethylene dithiocarbonate,
J. Electron Spectrosc. Relat. Phenom., 1975, 7, 191. [all data]