7H-Dibenzo(a,g)carbazole
- Formula: C20H13N
- Molecular weight: 267.3239
- IUPAC Standard InChIKey: NRZXZFVGTNEKPS-UHFFFAOYSA-N
- CAS Registry Number: 207-84-1
- Chemical structure:
View 3d structure (requires JavaScript / HTML 5) - Other names: 1,2,5,6-Dibenzcarbazole; Dibenzo[a,g]carbazole; 1,2:5,6-Dibenzocarbazole

Gas phase ion energetics data

Data compiled by: Henry M. Rosenstock, Keith Draxl, Bruce W. Steiner, and John T. Herron
Ionization energy determinations
IE (eV) | Method | Reference |
---|---|---|
6.9 ± 0.1 | EI | Riepe and Zander, 1969 |

Lee's RI, non-polar column, temperature ramp

Column type | Active phase | I | Reference | Comment |
---|---|---|---|---|
Capillary | SE-52 | 502.30 | Vassilaros, Kong, et al., 1982 | 20. m/0.30 mm/0.25 μm, H2, 40. C @ 2. min, 4. K/min; Tend: 265. C |

References

Riepe and Zander, 1969
Riepe, W.; Zander, M.,
Massenspektroskopische Untersuchungen an Carbazolen,
Z. Naturforsch., 1969, 24a, 2017. [all data]
Vassilaros, Kong, et al., 1982
Vassilaros, D.L.; Kong, R.C.; Later, D.W.; Lee, M.L.,
Linear retention index system for polycyclic aromatic compounds. Critical evaluation and additional indices,
J. Chromatogr., 1982, 252, 1-20, https://doi.org/10.1016/S0021-9673(01)88394-1
. [all data]