1,8-Naphthalenediamine, N,N,N',N'-tetramethyl-
- Formula: C14H18N2
- Molecular weight: 214.3061
- IUPAC Standard InChIKey: GJFNRSDCSTVPCJ-UHFFFAOYSA-N
- CAS Registry Number: 20734-58-1
- Chemical structure:
View 3d structure (requires JavaScript / HTML 5) - Other names: 1,8-Bis(dimethylamino)naphthalene; Proton sponge; N,N,N',N'-Tetramethyl-1,8-naphthalenediamine; N,N,N',N'-tetramethylnaphthalene-1,8-diamine

Phase change data

Data compiled by: William E. Acree, Jr., James S. Chickos
Quantity | Value | Units | Method | Reference | Comment |
---|---|---|---|---|---|
ΔvapH° | 76.7 ± 0.4 | kJ/mol | GS | Verevkin, Georgieva, et al., 2007 | Based on data from 324. to 364. K. |
Quantity | Value | Units | Method | Reference | Comment |
ΔsubH° | 94.7 ± 0.8 | kJ/mol | GS | Verevkin, Georgieva, et al., 2007 | Based on data from 324. to 364. K. |

Gas phase ion energetics data

Data evaluated as indicated in comments:
HL - Edward P. Hunter and Sharon G. Lias
Data compiled as indicated in comments:
LLK - Sharon G. Lias, Rhoda D. Levin, and Sherif A. Kafafi
Quantity | Value | Units | Method | Reference | Comment |
---|---|---|---|---|---|
Proton affinity (review) | 1028.2 | kJ/mol | N/A | Hunter and Lias, 1998 | HL |
Quantity | Value | Units | Method | Reference | Comment |
Gas basicity | 995.8 | kJ/mol | N/A | Hunter and Lias, 1998 | HL |
Ionization energy determinations
IE (eV) | Method | Reference | Comment |
---|---|---|---|
6.45 ± 0.02 | PE | Maier, 1974 | LLK |

References

Verevkin, Georgieva, et al., 2007
Verevkin, Sergey P.; Georgieva, Miglena; Melkhanova, Svetlana V.,
Vapor Pressures and Phase Transitions of a Series of the Aminonaphthalenes,
J. Chem. Eng. Data, 2007, 52, 1, 286-290, https://doi.org/10.1021/je060394v
. [all data]
Hunter and Lias, 1998
Hunter, E.P.; Lias, S.G.,
Evaluated Gas Phase Basicities and Proton Affinities of Molecules: An Update,
J. Phys. Chem. Ref. Data, 1998, 27, 3, 413-656, https://doi.org/10.1063/1.556018
. [all data]
Maier, 1974
Maier, J.P.,
Photoelectron spectroscopy of peri- amino naphthalenes,
Helv. Chim. Acta, 1974, 57, 994. [all data]