Phenanthrene-9,l0-d2
- Formula: C14H8D2
- Molecular weight: 180.2415
- IUPAC Standard InChIKey: YNPNZTXNASCQKK-QDRJLNDYSA-N
- CAS Registry Number: 20722-48-9
- Chemical structure:
View 3d structure (requires JavaScript / HTML 5) - Isotopologues:

Gas phase ion energetics data

Data compiled by: Henry M. Rosenstock, Keith Draxl, Bruce W. Steiner, and John T. Herron
Ionization energy determinations
IE (eV) | Method | Reference |
---|---|---|
8.03 | EI | Nounou, 1968 |

References

Nounou, 1968
Nounou, P.,
Etude des composes aromatiques par spectrometrie de masse. III. Interpretation des processus d'ionisation et de dissociation des molecules de phenanthrene et de methyl-phenanthrene par impact electronique,
J. Chim. Phys., 1968, 65, 700. [all data]