Acenaphtho(1,2-b)quinoxaline
- Formula: C18H10N2
- Molecular weight: 254.2854
- IUPAC Standard InChIKey: VRSLSEDOBUYIMM-UHFFFAOYSA-N
- CAS Registry Number: 207-11-4
- Chemical structure:
View 3d structure (requires JavaScript / HTML 5) - Other names: 7,10-Diaza-8,9-benzoflotruranthene; 7,10-Diaza-8,9-benzofluoranthene; 7,12-Diazabenzo(k)fluoranthene

Gas phase ion energetics data

Data compiled by: Henry M. Rosenstock, Keith Draxl, Bruce W. Steiner, and John T. Herron
Ionization energy determinations
IE (eV) | Method | Reference |
---|---|---|
8.6 ± 0.1 | EI | Gallegos, 1968 |

References

Gallegos, 1968
Gallegos, E.J.,
Mass spectrometry and ionization energies of some condensed-ring aromatic and heterocyclic compounds,
J. Phys. Chem., 1968, 72, 3452. [all data]