5-Methylene 1,3-cyclohexadiene
- Formula: C7H8
- Molecular weight: 92.1384
- IUPAC Standard InChIKey: OSBSXTGABLIDRX-UHFFFAOYSA-N
- CAS Registry Number: 20679-59-8
- Chemical structure:
View 3d structure (requires JavaScript / HTML 5) - Permanent link for this species. Use this link for bookmarking this species for future reference.

Gas phase thermochemistry data

Data compiled by: Hussein Y. Afeefy, Joel F. Liebman, and Stephen E. Stein
Quantity | Value | Units | Method | Reference | Comment |
---|---|---|---|---|---|
ΔfH°gas | 196.6 | kJ/mol | Ion | Bally, Hasselmann, et al., 1985 | Authors suspected their value |
ΔfH°gas | 150. ± 10. | kJ/mol | Ion | Bartmess, 1982 | Bracketing with RS- |

Reaction thermochemistry data

Data compiled by: Hussein Y. Afeefy, Joel F. Liebman, and Stephen E. Stein
Individual Reactions
By formula: C7H8 = C7H8
Quantity | Value | Units | Method | Reference | Comment |
---|---|---|---|---|---|
ΔrH° | -100. ± 10. | kJ/mol | Cm | Bartmess and Griffith, 1990 | gas phase; Gas phase acidity |

Gas phase ion energetics data

Data compiled as indicated in comments:
LBLHLM - Sharon G. Lias, John E. Bartmess, Joel F. Liebman, John L. Holmes, Rhoda D. Levin, and W. Gary Mallard
Ionization energy determinations
IE (eV) | Method | Reference | Comment |
---|---|---|---|
7.9 | EI | Bally, Hasselmann, et al., 1985, 2 | LBLHLM |
8.1 | EI | Bally, Hasselmann, et al., 1985, 2 | Vertical value; LBLHLM |

References

Bally, Hasselmann, et al., 1985
Bally, T.; Hasselmann, D.; Loosen, K.,
41. The molecular ion of 5-methylene-1,3-cyclohexadiene: electronic absorption spectrum and revised enthalpy of formation,
Helv. Chim. Acta, 1985, 68, 345-354. [all data]
Bartmess, 1982
Bartmess, J.E.,
Gas-phase ion chemistry of 5-methylene-1,3-cyclohexadiene (o-isotoluene) and 3-methylene-1,4-cyclohexadiene (p-isotoluene),
J. Am. Chem. Soc., 1982, 104, 335-337. [all data]
Bartmess and Griffith, 1990
Bartmess, J.E.; Griffith, S.S.,
Tautomerization energetics of benzoannelated toluenes,
J. Am. Chem. Soc., 1990, 112, 2931-2936. [all data]
Bally, Hasselmann, et al., 1985, 2
Bally, T.; Hasselmann, D.; Loosen, K.,
41. The molecular ion of 5-methylene-1,3-cyclohexadiene: Electronic absorption spectrum and revised enthalpy of formation,
Helv. Chim. Acta, 1985, 68, 345. [all data]