Stannane, dimethyl-
- Formula: C2H8Sn
- Molecular weight: 150.795
- IUPAC Standard InChIKey: QXDJFNYEWKDJJA-UHFFFAOYSA-N
- CAS Registry Number: 2067-76-7
- Chemical structure:
View 3d structure (requires JavaScript / HTML 5) - Other names: Dimethyltin dihydride

Gas phase ion energetics data

Data compiled by: Sharon G. Lias, John E. Bartmess, Joel F. Liebman, John L. Holmes, Rhoda D. Levin, and W. Gary Mallard
Ionization energy determinations
IE (eV) | Method | Reference |
---|---|---|
10.0 | PE | Lango, Szepes, et al., 1984 |
8.9 | EI | Lango, Szepes, et al., 1984 |
Appearance energy determinations
Ion | AE (eV) | Other Products | Method | Reference | Comment |
---|---|---|---|---|---|
CH3Sn+ | 10.9 | ? | EI | Lango, Szepes, et al., 1984 | |
CH4Sn+ | 9.8 | CH3+H/CH4 | EI | Lango, Szepes, et al., 1984 | |
CH5Sn+ | 10.6 | CH3 | EI | Lango, Szepes, et al., 1984 | |
C2H6Sn+ | 9.9 | H2 | EI | Lango, Szepes, et al., 1984 | |
C2H7Sn+ | 10.4 | H | EI | Lango, Szepes, et al., 1984 | |
Sn+ | 10.4 | ? | EI | Lango, Szepes, et al., 1984 |

Phase change data

Data compiled by: José A. Martinho Simões
Quantity | Value | Units | Method | Reference | Comment |
---|---|---|---|---|---|
ΔvapH° | 6.79 | kcal/mol | N/A | Finholt, Bond, et al., 1947 |

References

Lango, Szepes, et al., 1984
Lango, J.; Szepes, L.; Csaszar, P.; Innorta, G.,
Studies on the unimolecular decomposition processes of organometallic ions,
J. Organomet. Chem., 1984, 269, 133. [all data]