C2H5C(CH3)2COCH3
- Formula: C7H14O
- Molecular weight: 114.1855
- IUPAC Standard InChIKey: QSHJLBQLQVSEFV-UHFFFAOYSA-N
- CAS Registry Number: 20669-04-9
- Chemical structure:
View 3d structure (requires JavaScript / HTML 5) - Other names: 3,3-Dimethyl-2-pentanone; 3,3-Dimethylpentan-2-one

Gas phase thermochemistry data

Data compiled by: Hussein Y. Afeefy, Joel F. Liebman, and Stephen E. Stein
Quantity | Value | Units | Method | Reference | Comment |
---|---|---|---|---|---|
ΔfH°gas | -303.8 ± 1.7 | kJ/mol | Ccb | Dubois and Herzog, 1972 |

Phase change data

Data compiled by: Thermodynamics Research Center, NIST Boulder Laboratories, Chris Muzny director
Quantity | Value | Units | Method | Reference | Comment |
---|---|---|---|---|---|
Tboil | 404. ± 2. | K | AVG | N/A | Average of 7 values; Individual data points |

Gas phase ion energetics data

Data compiled as indicated in comments:
LLK - Sharon G. Lias, Rhoda D. Levin, and Sherif A. Kafafi
Ionization energy determinations
IE (eV) | Method | Reference | Comment |
---|---|---|---|
9.019 ± 0.005 | PE | Hernandez, Masclet, et al., 1977 | LLK |

References

Dubois and Herzog, 1972
Dubois, J.-E.; Herzog, H.,
Heats of formation of aliphatic ketones: Structure correlation based on environment treatment,
J. Chem. Soc. Chem. Commun., 1972, 932-933. [all data]
Hernandez, Masclet, et al., 1977
Hernandez, R.; Masclet, P.; Mouvier, G.,
Spectroscopie de photoelectrons d'aldehydes et de cetones aliphatiques,
J. Electron Spectrosc. Relat. Phenom., 1977, 10, 333. [all data]