1-butyl-3-nitrobenzene
- Formula: C10H13NO2
- Molecular weight: 179.2157
- IUPAC Standard InChIKey: INMYTBBXRJWIOA-UHFFFAOYSA-N
- CAS Registry Number: 20651-76-7
- Chemical structure:
View 3d structure (requires JavaScript / HTML 5) - Other names: Benzene, 1-butyl-3-nitro-

Phase change data

Data compiled by: Robert L. Brown and Stephen E. Stein
Reduced pressure boiling point
Tboil (K) | Pressure (bar) | Reference |
---|---|---|
548.2 | 1.00 | Weast and Grasselli, 1989 |

Gas phase ion energetics data

Data compiled by: Sharon G. Lias, Rhoda D. Levin, and Sherif A. Kafafi
Ionization energy determinations
IE (eV) | Method | Reference |
---|---|---|
9.9 ± 0.1 | EI | Lightner, Majeti, et al., 1972 |
Appearance energy determinations
Ion | AE (eV) | Other Products | Method | Reference | Comment |
---|---|---|---|---|---|
C7H6NO2+ | 13.1 ± 0.1 | ? | EI | Lightner, Majeti, et al., 1972 | |
C7H7NO2+ | 11.5 ± 0.1 | CH2=CHCH3 | EI | Lightner, Majeti, et al., 1972 |

References

Weast and Grasselli, 1989
CRC Handbook of Data on Organic Compounds, 2nd Editon, Weast,R.C and Grasselli, J.G., ed(s)., CRC Press, Inc., Boca Raton, FL, 1989, 1. [all data]
Lightner, Majeti, et al., 1972
Lightner, D.A.; Majeti, S.; Nicoletti, R.; Thommen, E.,
Benzyl vs. tropylium ions in the electron impact induced decomposition of n- butylbenzenes,
Intra-Sci. Chem. Rep., 1972, 6, 113. [all data]