Benzene, 1-butyl-4-nitro-
- Formula: C10H13NO2
- Molecular weight: 179.2157
- IUPAC Standard InChIKey: JZRBCNLSIDKBMG-UHFFFAOYSA-N
- CAS Registry Number: 20651-75-6
- Chemical structure:
View 3d structure (requires JavaScript / HTML 5) - Other names: p-Nitrobutylbenzene; 1-butyl-4-nitrobenzene

Phase change data

Data compiled by: Robert L. Brown and Stephen E. Stein
Reduced pressure boiling point
Tboil (K) | Pressure (bar) | Reference |
---|---|---|
417.2 | 0.020 | Weast and Grasselli, 1989 |

Gas phase ion energetics data

Data compiled by: Sharon G. Lias, Rhoda D. Levin, and Sherif A. Kafafi
Ionization energy determinations
IE (eV) | Method | Reference |
---|---|---|
10.1 ± 0.1 | EI | Lightner, Majeti, et al., 1972 |
Appearance energy determinations
Ion | AE (eV) | Other Products | Method | Reference | Comment |
---|---|---|---|---|---|
C7H6NO2+ | 12.5 ± 0.1 | ? | EI | Lightner, Majeti, et al., 1972 | |
C7H7NO2+ | 11.4 ± 0.1 | CH2=CHCH3 | EI | Lightner, Majeti, et al., 1972 |

Kovats' RI, polar column, isothermal

Column type | Active phase | Temperature (C) | I | Reference | Comment |
---|---|---|---|---|---|
Packed | Carbowax 20M | 200. | 2234. | Vernon and Suratman, 1983 | He, Silanized white support; Column length: 2. m |

References

Weast and Grasselli, 1989
CRC Handbook of Data on Organic Compounds, 2nd Editon, Weast,R.C and Grasselli, J.G., ed(s)., CRC Press, Inc., Boca Raton, FL, 1989, 1. [all data]
Lightner, Majeti, et al., 1972
Lightner, D.A.; Majeti, S.; Nicoletti, R.; Thommen, E.,
Benzyl vs. tropylium ions in the electron impact induced decomposition of n- butylbenzenes,
Intra-Sci. Chem. Rep., 1972, 6, 113. [all data]
Vernon and Suratman, 1983
Vernon, F.; Suratman, J.B.,
The retention index system applied to alkylbenzenes and monosubstituted derivatives,
Chromatographia, 1983, 17, 11, 600-604, https://doi.org/10.1007/BF02261943
. [all data]