4-Butylbenzonitrile
- Formula: C11H13N
- Molecular weight: 159.2276
- IUPAC Standard InChIKey: KGZNJCXNPLUEQS-UHFFFAOYSA-N
- CAS Registry Number: 20651-73-4
- Chemical structure:
View 3d structure (requires JavaScript / HTML 5) - Other names: Benzonitrile,4-butyl-; 1-Butyl-4-cyanobenzene

Gas phase ion energetics data

Data compiled as indicated in comments:
LLK - Sharon G. Lias, Rhoda D. Levin, and Sherif A. Kafafi
Ionization energy determinations
IE (eV) | Method | Reference | Comment |
---|---|---|---|
10.1 ± 0.1 | EI | Lightner, Majeti, et al., 1972 | LLK |
Appearance energy determinations
Ion | AE (eV) | Other Products | Method | Reference | Comment |
---|---|---|---|---|---|
C8H6N+ | 12.7 ± 0.1 | ? | EI | Lightner, Majeti, et al., 1972 | LLK |
C8H7N+ | 11.7 ± 0.1 | CH2=CHCH3 | EI | Lightner, Majeti, et al., 1972 | LLK |

References

Lightner, Majeti, et al., 1972
Lightner, D.A.; Majeti, S.; Nicoletti, R.; Thommen, E.,
Benzyl vs. tropylium ions in the electron impact induced decomposition of n- butylbenzenes,
Intra-Sci. Chem. Rep., 1972, 6, 113. [all data]