Benzene,1-butyl-3-fluoro-
- Formula: C10H13F
- Molecular weight: 152.2086
- IUPAC Standard InChIKey: ACEOYXOVVVGANV-UHFFFAOYSA-N
- CAS Registry Number: 20651-66-5
- Chemical structure:
View 3d structure (requires JavaScript / HTML 5) - Permanent link for this species. Use this link for bookmarking this species for future reference.

Gas phase ion energetics data

Data compiled by: Sharon G. Lias, Rhoda D. Levin, and Sherif A. Kafafi
Appearance energy determinations
Ion | AE (eV) | Other Products | Method | Reference | Comment |
---|---|---|---|---|---|
C7H6F+ | 11.7 ± 0.1 | ? | EI | Lightner, Majeti, et al., 1972 | |
C7H7F+ | 10.2 ± 0.1 | CH2=CHCH3 | EI | Lightner, Majeti, et al., 1972 | |
C10H13+ | 9.2 ± 0.1 | F | EI | Lightner, Majeti, et al., 1972 |

References

Lightner, Majeti, et al., 1972
Lightner, D.A.; Majeti, S.; Nicoletti, R.; Thommen, E.,
Benzyl vs. tropylium ions in the electron impact induced decomposition of n- butylbenzenes,
Intra-Sci. Chem. Rep., 1972, 6, 113. [all data]