Fluoranthene
- Formula: C16H10
- Molecular weight: 202.2506
- IUPAC Standard InChIKey: GVEPBJHOBDJJJI-UHFFFAOYSA-N
- CAS Registry Number: 206-44-0
- Chemical structure:
- Other names: Benzene, 1,2-(1,8-naphthalenediyl)-; Benzo[jk]fluorene; Idryl; 1,2-(1,8-Naphthylene)benzene; Benzene, 1,2-(1,8-naphthylene)-; 1,2-Benzacenaphthene; 1,2-(1,8-Naphthalenediyl)benzene; Rcra waste number U120; 1,2-(1,8-Naphthalene)benzene; Fluoranthrene; NSC 6803

Gas phase thermochemistry data

Data compiled as indicated in comments:
DRB - Donald R. Burgess, Jr.
ALS - Hussein Y. Afeefy, Joel F. Liebman, and Stephen E. Stein
GT - Glushko Thermocenter, Russian Academy of Sciences, Moscow
Quantity | Value | Units | Method | Reference | Comment |
---|---|---|---|---|---|
ΔfH°gas | 69.65 ± 0.96 | kcal/mol | Review | Roux, Temprado, et al., 2008 | There are sufficient literature values to make a qualified recommendation where the suggested value is in good agreement with values predicted using thermochemical cycles or from reliable estimates. In general, the evaluated uncertainty limits are on the order of (2 to 4) kJ/mol.; DRB |
ΔfH°gas | 69.26 | kcal/mol | N/A | Westrum and Wong, 1967 | Value computed using ΔfHsolid° value of 189.8±0.4 kj/mol from Westrum and Wong, 1967 and ΔsubH° value of 100.0 kj/mol from Boyd, Christensen, et al., 1965.; DRB |
ΔfH°gas | 69.78 ± 0.52 | kcal/mol | Ccb | Boyd, Christensen, et al., 1965 | Reanalyzed by Cox and Pilcher, 1970, Original value = 70.4 ± 1.8 kcal/mol; ALS |
Constant pressure heat capacity of gas
Cp,gas (cal/mol*K) | Temperature (K) | Reference | Comment |
---|---|---|---|
10.04 | 50. | Dorofeeva O.V., 1989 | These values are based on the experimental assignment of vibrational spectra. The S(300 K) and Cp(300 K) values calculated by MM3 method [ Pope C.J., 1995] are 10 and 4 J/mol*K, respectively, larger than selected ones. Recommended values are also reproduced in the reference book [ Frenkel M., 1994].; GT |
15.71 | 100. | ||
22.90 | 150. | ||
31.171 | 200. | ||
44.192 | 273.15 | ||
48.66 ± 0.48 | 298.15 | ||
48.984 | 300. | ||
65.674 | 400. | ||
79.579 | 500. | ||
90.674 | 600. | ||
99.512 | 700. | ||
106.64 | 800. | ||
112.48 | 900. | ||
117.32 | 1000. | ||
121.37 | 1100. | ||
124.79 | 1200. | ||
127.69 | 1300. | ||
130.17 | 1400. | ||
132.30 | 1500. |

Condensed phase thermochemistry data

Data compiled as indicated in comments:
DRB - Donald R. Burgess, Jr.
ALS - Hussein Y. Afeefy, Joel F. Liebman, and Stephen E. Stein
DH - Eugene S. Domalski and Elizabeth D. Hearing
Quantity | Value | Units | Method | Reference | Comment |
---|---|---|---|---|---|
ΔfH°solid | 45.46 ± 0.67 | kcal/mol | Review | Roux, Temprado, et al., 2008 | There are sufficient literature values to make a qualified recommendation where the suggested value is in good agreement with values predicted using thermochemical cycles or from reliable estimates. In general, the evaluated uncertainty limits are on the order of (2 to 4) kJ/mol.; DRB |
ΔfH°solid | 45.36 ± 0.09 | kcal/mol | Ccr | Westrum and Wong, 1967 | ALS |
ΔfH°solid | 46.0 ± 1.3 | kcal/mol | Ccb | Boyd, Christensen, et al., 1965 | ALS |
Quantity | Value | Units | Method | Reference | Comment |
ΔcH°solid | -1891.77 ± 0.09 | kcal/mol | Ccr | Westrum and Wong, 1967 | Corresponding ΔfHºsolid = 45.38 kcal/mol (simple calculation by NIST; no Washburn corrections); ALS |
ΔcH°solid | -1892.4 ± 1.3 | kcal/mol | Ccb | Boyd, Christensen, et al., 1965 | Corresponding ΔfHºsolid = 46.0 kcal/mol (simple calculation by NIST; no Washburn corrections); ALS |
Quantity | Value | Units | Method | Reference | Comment |
S°solid,1 bar | 55.110 | cal/mol*K | N/A | Wong and Westrum, 1971 | DH |
Constant pressure heat capacity of solid
Cp,solid (cal/mol*K) | Temperature (K) | Reference | Comment |
---|---|---|---|
55.031 | 298.15 | Wong and Westrum, 1971 | T = 5 to 427 K.; DH |

Phase change data

Data compiled as indicated in comments:
TRC - Thermodynamics Research Center, NIST Boulder Laboratories, Chris Muzny director
AC - William E. Acree, Jr., James S. Chickos
DRB - Donald R. Burgess, Jr.
ALS - Hussein Y. Afeefy, Joel F. Liebman, and Stephen E. Stein
DH - Eugene S. Domalski and Elizabeth D. Hearing
Quantity | Value | Units | Method | Reference | Comment |
---|---|---|---|---|---|
Tfus | 381.0 | K | N/A | Casellato, Vecchi, et al., 1973 | Uncertainty assigned by TRC = 0.2 K; TRC |
Tfus | 386.1 | K | N/A | Sangster and Irvine, 1956 | Uncertainty assigned by TRC = 3. K; TRC |
Tfus | 385.2 | K | N/A | Sangster and Irvine, 1956 | Uncertainty assigned by TRC = 3. K; TRC |
Tfus | 385.4 | K | N/A | Sangster and Irvine, 1956 | Uncertainty assigned by TRC = 3. K; TRC |
Tfus | 383.45 | K | N/A | Schuyer, Blom, et al., 1953 | Uncertainty assigned by TRC = 1. K; TRC |
Quantity | Value | Units | Method | Reference | Comment |
Ttriple | 383.340 | K | N/A | Wong and Westrum, 1971, 2 | Uncertainty assigned by TRC = 0.005 K; TRC |
Ttriple | 383.330 | K | N/A | Wong and Westrum, 1971, 2 | Uncertainty assigned by TRC = 0.005 K; TRC |
Quantity | Value | Units | Method | Reference | Comment |
ΔvapH° | 20.7 ± 0.31 | kcal/mol | GC | Ribeiro da Silva, Gomes, et al., 2005 | Based on data from 423. to 493. K.; AC |
Quantity | Value | Units | Method | Reference | Comment |
ΔsubH° | 24.19 ± 0.67 | kcal/mol | Review | Roux, Temprado, et al., 2008 | There are sufficient literature values to make a qualified recommendation where the suggested value is in good agreement with values predicted using thermochemical cycles or from reliable estimates. In general, the evaluated uncertainty limits are on the order of (2 to 4) kJ/mol.; DRB |
ΔsubH° | 23.7 ± 0.2 | kcal/mol | V | Morawetz, 1972 | ALS |
ΔsubH° | 23.7 ± 0.2 | kcal/mol | C | Morawetz, 1972, 2 | See also Pedley and Rylance, 1977.; AC |
ΔsubH° | 24.4 ± 0.5 | kcal/mol | V | Boyd, Christensen, et al., 1965 | ALS |
ΔsubH° | 23.90 | kcal/mol | N/A | Boyd, Christensen, et al., 1965 | DRB |
Enthalpy of vaporization
ΔvapH (kcal/mol) | Temperature (K) | Method | Reference | Comment |
---|---|---|---|---|
19.0 | 398. | GC | Lei, Chankalal, et al., 2002 | Based on data from 323. to 473. K.; AC |
18.5 | 398. | GC | Hinckley, Bidleman, et al., 1990 | Based on data from 343. to 453. K.; AC |
14.9 | 518. | A | Stephenson and Malanowski, 1987 | Based on data from 503. to 658. K. See also Tsypikina and Ya, 1955.; AC |
Antoine Equation Parameters
log10(P) = A − (B / (T + C))
P = vapor pressure (atm)
T = temperature (K)
View plot Requires a JavaScript / HTML 5 canvas capable browser.
Temperature (K) | A | B | C | Reference | Comment |
---|---|---|---|---|---|
470. to 657.4 | 2.50642 | 1017.476 | -253.875 | Tsypkina, 1955 | Coefficents calculated by NIST from author's data. |
Enthalpy of sublimation
ΔsubH (kcal/mol) | Temperature (K) | Method | Reference | Comment |
---|---|---|---|---|
23.5 | 383. | GS | Nass, Lenoir, et al., 1995 | Based on data from 313. to 453. K.; AC |
20.2 ± 0.2 | 303. | GS | Sonnefeld, Zoller, et al., 1983 | Based on data from 283. to 323. K.; AC |
24.4 ± 0.5 | 340. | ME | Boyd, Christensen, et al., 1965 | Based on data from 328. to 353. K. See also Cox and Pilcher, 1970, 2.; AC |
24.52 | 328. | N/A | Hoyer and Peperle, 1958 | Based on data from 298. to 358. K.; AC |
Enthalpy of fusion
ΔfusH (kcal/mol) | Temperature (K) | Reference | Comment |
---|---|---|---|
4.4761 | 383.36 | Wong and Westrum, 1971 | DH |
4.479 | 383.4 | Domalski and Hearing, 1996 | AC |
Entropy of fusion
ΔfusS (cal/mol*K) | Temperature (K) | Reference | Comment |
---|---|---|---|
11.68 | 383.36 | Wong and Westrum, 1971 | DH |

Henry's Law data

Data compiled by: Rolf Sander
Henry's Law constant (water solution)
kH(T) = k°H exp(d(ln(kH))/d(1/T) ((1/T) - 1/(298.15 K)))
k°H = Henry's law constant for solubility in water at 298.15 K (mol/(kg*bar))
d(ln(kH))/d(1/T) = Temperature dependence constant (K)
k°H (mol/(kg*bar)) | d(ln(kH))/d(1/T) (K) | Method | Reference |
---|---|---|---|
110. | 6900. | X | N/A |
0.46 | L | N/A |

Gas phase ion energetics data

Data evaluated as indicated in comments:
HL - Edward P. Hunter and Sharon G. Lias
L - Sharon G. Lias
Data compiled as indicated in comments:
MM - Michael M. Meot-Ner (Mautner)
LL - Sharon G. Lias and Joel F. Liebman
LLK - Sharon G. Lias, Rhoda D. Levin, and Sherif A. Kafafi
RDSH - Henry M. Rosenstock, Keith Draxl, Bruce W. Steiner, and John T. Herron
B - John E. Bartmess
Quantity | Value | Units | Method | Reference | Comment |
---|---|---|---|---|---|
IE (evaluated) | 7.9 ± 0.1 | eV | N/A | N/A | L |
Quantity | Value | Units | Method | Reference | Comment |
Proton affinity (review) | 198.0 | kcal/mol | N/A | Hunter and Lias, 1998 | HL |
Quantity | Value | Units | Method | Reference | Comment |
Gas basicity | 191.4 | kcal/mol | N/A | Hunter and Lias, 1998 | HL |
Electron affinity determinations
EA (eV) | Method | Reference | Comment |
---|---|---|---|
0.629995 | ECD | Michl, 1969 | B |
Proton affinity at 298K
Proton affinity (kcal/mol) | Reference | Comment |
---|---|---|
197.6 | Aue, Guidoni, et al., 2000 | Experimental literature data re-evaluated by the authors using ab initio protonation entropies; MM |
Gas basicity at 298K
Gas basicity (review) (kcal/mol) | Reference | Comment |
---|---|---|
191.1 | Aue, Guidoni, et al., 2000 | Experimental literature data re-evaluated by the authors using ab initio protonation entropies; MM |
Ionization energy determinations
IE (eV) | Method | Reference | Comment |
---|---|---|---|
7.9 ± 0.1 | TRPI | Ling and Lifshitz, 1995 | LL |
7.95 ± 0.04 | PE | Boschi, Clar, et al., 1974 | LLK |
7.80 ± 0.01 | PI | Dewar, Haselbach, et al., 1970 | RDSH |
7.72 | CTS | Slifkin and Allison, 1967 | RDSH |
Appearance energy determinations
Ion | AE (eV) | Other Products | Method | Reference | Comment |
---|---|---|---|---|---|
C16H8+ | 11.50 ± 0.12 | 2H | DER | Ling and Lifshitz, 1995 | LL |
C16H8+ | 11.24 ± 0.25 | H2 | DER | Ling and Lifshitz, 1995 | LL |
C16H9+ | 12.38 ± 0.14 | H | DER | Ling and Lifshitz, 1995 | LL |

Lee's RI, non-polar column, custom temperature program

Data compiled by: NIST Mass Spectrometry Data Center, William E. Wallace, director

Column type CapillaryCapillaryCapillaryCapillaryCapillary
Active phase DB-5HP-5MSHP-5MSHP-5MS5 % Phenyl methyl siloxane
Column length (m) 60.30.30.30.
Carrier gas  HeHeHe
Substrate
Column diameter (mm)  0.250.250.25
Phase thickness (μm)  0.250.250.25
Program not specified60C(2min) => 6C/min => 258C => 2C/min => 300C(4min)not specifiednot specified70 0C (2 min) 30 0C/min -> 150 0C 5 0C/min -> 200 0C 4 0C/min -> 310 0C (5 min)
I 344.6344.96344.49344.96340.10
ReferenceFuentes, Font, et al., 2007Wang, Li, et al., 2007Wang, Li, et al., 2007, 2Wang, Li, et al., 2007, 2Skrbic and Onjia, 2006
Comment MSDC-RI MSDC-RI MSDC-RI MSDC-RI MSDC-RI
Column type CapillaryCapillaryCapillaryCapillaryCapillary
Active phase DB-5MSHP-5MSLM-5LM-5Ultra-1
Column length (m) 60.30.30.30.50.
Carrier gas  HeHeHeNitrogen
Substrate
Column diameter (mm) 0.250.300.250.250.32
Phase thickness (μm)  0.250.250.250.50
Program not specified50 0C (2 min) 8 0C/min -> 120 0C (3 min) 10 0C/min -> 230 0C60C(2min) => 15C/min => 180C => 5C/min => 280C (10min)60C(2min) => 15C/min => 180C => 5C/min => 280C (10min)40-100 0C 3-15 0C/min -> 290 0C
I 338.2389.98340.21340.44338.5
ReferenceAracil, Font, et al., 2005Cheng, Liu, et al., 2005Ré-Poppi and Santiago-Silva, 2005Ré-Poppi and Santiago-Silva, 2005Sremac, Skrbic, et al., 2005
Comment MSDC-RI MSDC-RI MSDC-RI MSDC-RI MSDC-RI
Column type CapillaryCapillaryCapillaryCapillaryCapillary
Active phase Ultra-1DB-5LM-5LM-5HP-5
Column length (m) 50.30.30.30.25.
Carrier gas Nitrogen HeHeHe
Substrate
Column diameter (mm) 0.320.250.250.250.2
Phase thickness (μm) 0.500.250.250.250.11
Program 40-100 0C 3-15 0C/min -> 290 0Cnot specified60C(2min) => 15C/min => 180C => 5C/min => 280C(5min)60C(2min) => 15C/min => 180C => 5C/min => 280C(5min)106C(0.2min) => 40C/min => 120C => 3C/min => 310C(10min)
I 344.0344.9340.35340.44342.65
ReferenceSremac, Skrbic, et al., 2005Lundstedt, Haglund, et al., 2003Ré-Poppi and Santiago-Silva, 2002Ré-Poppi and Santiago-Silva, 2002Reckendorf, 1997
Comment MSDC-RI MSDC-RI MSDC-RI MSDC-RI MSDC-RI
Column type CapillaryCapillaryCapillaryCapillaryCapillary
Active phase DB-5DB-5SE-54SE-52SE-54
Column length (m) 30.30.30.30.
Carrier gas HeHe
Substrate
Column diameter (mm) 0.250.250.250.25
Phase thickness (μm) 0.250.25
Program 90C (1min) => 10C/min => 120C => 4C/min => 310C (20min)90C (1min) => 10C/min => 120C => 4C/min => 310C (20min)not specifiednot specifiednot specified
I 343.25343.31344.01344.51343.24
ReferenceZamperlini, Silva, et al., 1997Zamperlini, Silva, et al., 1997Chen, 1996Shaogang and Xiaobai, 1994Guillen, Iglesias, et al., 1992
Comment MSDC-RI MSDC-RI MSDC-RI MSDC-RI MSDC-RI
Column type CapillaryCapillaryCapillaryCapillaryCapillary
Active phase SE-54DB-5DB-5DB-5OV-101
Column length (m) 15. 30.30.
Carrier gas HeHe
Substrate
Column diameter (mm) 0.25 0.320.32
Phase thickness (μm) 0.25
Program 125 0C (15 min) 1 0C/min -> 131 0C 4 0C/min -> 247 0C 8 0C/min -> 280 0C (15 min)70C(2min) => 30C/min => 150C => 5C/min => 200C => 4C/min => 310Cnot specifiednot specifiednot specified
I 344.6340.11344.01345.32344.6
ReferencePeterman and Delfino, 1990Takada, Onda, et al., 1990Naikwadi, Charbonneau, et al., 1987Naikwadi, Charbonneau, et al., 1987Tucminen, Wickstrom, et al., 1986
Comment MSDC-RI MSDC-RI MSDC-RI MSDC-RI MSDC-RI
Column type CapillaryCapillaryCapillaryCapillaryCapillary
Active phase SE-52SE-52SE-52SE-52SE-52
Column length (m)
Carrier gas
Substrate
Column diameter (mm)
Phase thickness (μm)
Program not specifiednot specifiednot specifiednot specifiednot specified
I 340.05340.88341.74342.74343.25
ReferenceShlyakhov, 1984Shlyakhov, 1984Shlyakhov, 1984Shlyakhov, 1984Shlyakhov, 1984
Comment MSDC-RI MSDC-RI MSDC-RI MSDC-RI MSDC-RI
Column type CapillaryCapillaryCapillary
Active phase SE-52SE-52SE-52
Column length (m)
Carrier gas
Substrate
Column diameter (mm)
Phase thickness (μm)
Program not specifiednot specifiednot specified
I 343.65344.01345.00
ReferenceShlyakhov, 1984Shlyakhov, 1984Shlyakhov, 1984
Comment MSDC-RI MSDC-RI MSDC-RI

Normal alkane RI, non-polar column, temperature ramp

Data compiled by: NIST Mass Spectrometry Data Center, William E. Wallace, director

Column type CapillaryCapillaryCapillaryCapillaryCapillary
Active phase C103H208C103H208HP-5HP-5HP-5
Column length (m)   30.30.30.
Carrier gas H2H2
Substrate
Column diameter (mm)   0.320.320.32
Phase thickness (μm) 0.250.250.250.250.25
Tstart (C) 80.100.50.50.50.
Tend (C) 275.275.310.310.310.
Heat rate (K/min) 5.4.5.5.5.
Initial hold (min)   2.2.2.
Final hold (min)
I 2098.2089.2052.2053.2057.
ReferenceDumitrescu, Buda, et al., 2000Dumitrescu, Buda, et al., 2000Miao and Wu, 1999Miao and Wu, 1999Miao and Wu, 1999
Comment MSDC-RI MSDC-RI MSDC-RI MSDC-RI MSDC-RI
Column type CapillaryCapillaryCapillaryCapillaryCapillary
Active phase HP-5HP-5HP-5HP-5HP-5
Column length (m) 30.30.30.30.30.
Carrier gas
Substrate
Column diameter (mm) 0.320.320.320.320.32
Phase thickness (μm) 0.250.250.250.250.25
Tstart (C) 50.50.50.50.50.
Tend (C) 310.310.310.310.310.
Heat rate (K/min) 5.5.5.5.5.
Initial hold (min) 2.2.2.2.2.
Final hold (min)
I 2058.2060.2061.2079.2080.
ReferenceMiao and Wu, 1999Miao and Wu, 1999Miao and Wu, 1999Miao and Wu, 1999Miao and Wu, 1999
Comment MSDC-RI MSDC-RI MSDC-RI MSDC-RI MSDC-RI
Column type CapillaryCapillary
Active phase Ultra-1SE-54
Column length (m) 50.25.
Carrier gas H2He
Substrate
Column diameter (mm) 0.20.32
Phase thickness (μm) 0.33
Tstart (C) 60.50.
Tend (C) 300.250.
Heat rate (K/min) 3.8.
Initial hold (min)  2.
Final hold (min) 35.12.
I 2031.2045.
ReferenceElizalde-González, Hutfliess, et al., 1996Harland, Cumming, et al., 1986
Comment MSDC-RI MSDC-RI

Kovats' RI, non-polar column, isothermal

View large format table.

Column type Active phase Temperature (C) I Reference Comment
CapillarySPB-5180.2057.Corbella, Rodríguez, et al., 199515. m/0.32 mm/0.25 μm, He
PackedOV-101250.2091.Rudenko, Bulychova, et al., 1984N2; Column length: 3. m
PackedOV-101230.2091.Grimmer and Böhnke, 1975Gas Chrom Q; Column length: 10. m
PackedSE-30200.2051.Shlyakhov, Anvaer, et al., 1975
CapillaryOV-101230.2091.Grimmer and Böhnke, 1972N2; Column length: 50. m; Column diameter: 0.50 mm

Van Den Dool and Kratz RI, non-polar column, temperature ramp

View large format table.

Column type Active phase I Reference Comment
CapillaryHP-5MS2053.5Zhao C.X., Li, et al., 200630. m/0.25 mm/0.25 μm, He, 4. K/min; Tstart: 80. C; Tend: 300. C
CapillaryDB-52060.1Song, Lai, et al., 200330. m/0.25 mm/0.25 μm, He, 4. K/min; Tstart: 40. C; Tend: 310. C
CapillaryDB-52060.1Song, Lai, et al., 200330. m/0.25 mm/0.25 μm, He, 40. C @ 5. min, 4. K/min; Tend: 310. C
CapillaryDB-52032.6Song, Lai, et al., 200330. m/0.25 mm/0.25 μm, He, 2. K/min; Tstart: 40. C; Tend: 310. C
CapillaryDB-52060.1Song, Lai, et al., 200330. m/0.25 mm/0.25 μm, He, 4. K/min; Tstart: 40. C; Tend: 310. C
CapillaryDB-52076.5Song, Lai, et al., 200330. m/0.25 mm/0.25 μm, He, 6. K/min; Tstart: 40. C; Tend: 310. C
CapillaryOV-12038.9Zhang, Shen, et al., 200025. m/0.2 mm/0.33 μm, 5. K/min; Tstart: 100. C; Tend: 180. C
CapillaryOV-12062.3Zhang, Shen, et al., 200025. m/0.2 mm/0.33 μm, 5. K/min; Tstart: 100. C; Tend: 180. C
CapillaryHP-5MS2085.Nahir, 199930. m/0.25 mm/0.25 μm, 10. K/min; Tstart: 50. C; Tend: 300. C
CapillaryDB-52032.6Lai and Song, 199530. m/0.25 mm/0.25 μm, He, 2. K/min; Tstart: 40. C; Tend: 310. C
CapillaryDB-52060.1Lai and Song, 199530. m/0.25 mm/0.25 μm, He, 4. K/min; Tstart: 40. C; Tend: 310. C
CapillaryDB-52076.5Lai and Song, 199530. m/0.25 mm/0.25 μm, He, 6. K/min; Tstart: 40. C; Tend: 310. C
CapillaryDB-52060.1Lai and Song, 199530. m/0.25 mm/0.25 μm, He, 4. K/min; Tstart: 40. C; Tend: 310. C
CapillaryDB-52060.1Lai and Song, 199530. m/0.25 mm/0.25 μm, He, 40. C @ 5. min, 4. K/min; Tend: 310. C
CapillaryDB-52084.Rostad and Pereira, 198630. m/0.26 mm/0.25 μm, He, 50. C @ 4. min, 6. K/min, 300. C @ 20. min
CapillarySE-522011.Beernaert, 1979He, 50. C @ 5. min, 6. K/min; Column length: 33.3 m; Column diameter: 0.50 mm; Tend: 320. C
CapillarySE-522009.Beernaert, 1979He, 50. C @ 5. min, 6. K/min; Column length: 16.6 m; Column diameter: 0.50 mm; Tend: 320. C
CapillarySE-522009.Beernaert, 1979He, 50. C @ 5. min, 6. K/min; Column length: 16.6 m; Column diameter: 0.50 mm; Tend: 320. C
CapillarySE-522009.Beernaert, 1979He, 50. C @ 5. min, 6. K/min; Column length: 16.6 m; Column diameter: 0.50 mm; Tend: 320. C
CapillarySE-522009.Beernaert, 1979He, 50. C @ 5. min, 6. K/min; Column length: 16.6 m; Column diameter: 0.50 mm; Tend: 320. C
CapillarySE-522009.Beernaert, 1979He, 50. C @ 5. min, 6. K/min; Column length: 16.6 m; Column diameter: 0.50 mm; Tend: 320. C
CapillarySE-522023.Beernaert, 1979He, 50. C @ 5. min, 6. K/min; Column length: 16.6 m; Column diameter: 0.50 mm; Tend: 320. C
CapillarySE-522023.Beernaert, 1979He, 50. C @ 5. min, 6. K/min; Column length: 16.6 m; Column diameter: 0.50 mm; Tend: 320. C
CapillarySE-522023.Beernaert, 1979He, 50. C @ 5. min, 6. K/min; Column length: 16.6 m; Column diameter: 0.50 mm; Tend: 320. C
CapillarySE-522023.Beernaert, 1979He, 50. C @ 5. min, 6. K/min; Column length: 16.6 m; Column diameter: 0.50 mm; Tend: 320. C
CapillarySE-522030.Beernaert, 1979He, 50. C @ 5. min, 6. K/min; Column length: 16.6 m; Column diameter: 0.50 mm; Tend: 320. C
CapillarySE-522030.Beernaert, 1979He, 50. C @ 5. min, 6. K/min; Column length: 16.6 m; Column diameter: 0.50 mm; Tend: 320. C
CapillarySE-522031.Beernaert, 1979He, 50. C @ 5. min, 6. K/min; Column length: 16.6 m; Column diameter: 0.50 mm; Tend: 320. C
CapillarySE-522037.Beernaert, 1979He, 50. C @ 5. min, 6. K/min; Column length: 16.6 m; Column diameter: 0.50 mm; Tend: 320. C
CapillarySE-522042.Beernaert, 1979He, 50. C @ 5. min, 6. K/min; Column length: 16.6 m; Column diameter: 0.50 mm; Tend: 320. C
CapillarySE-522044.Beernaert, 1979He, 50. C @ 5. min, 6. K/min; Column length: 16.6 m; Column diameter: 0.50 mm; Tend: 320. C
CapillarySE-522020.Carugno and Rossi, 1967N2, 1.8 K/min; Column length: 65. m; Column diameter: 0.3 mm; Tstart: 100. C; Tend: 300. C

Van Den Dool and Kratz RI, non-polar column, custom temperature program

View large format table.

Column type Active phase I Reference Comment
CapillaryHP-12020.45Dimitriou-Christidis, Harris, et al., 200330. m/0.25 mm/0.25 μm; Program: 60C => 7C/min => 225C => 15C/min => 300C(11.43min)
CapillaryHP-52068.42Dimitriou-Christidis, Harris, et al., 200330. m/0.25 mm/0.25 μm; Program: 60C => 7C/min => 225C => 15C/min => 300C(11.43min)
CapillaryDB-52084.Havenga and Rohwer, 199930. m/0.25 mm/0.25 μm, He; Program: 60 0C 7 0C/min -> 130 0C 5 0C/min -> 200 0C 6 0C/min -> 260 0C 20 0C/min -> 320 0C (4 min)
Capillary5 % Phenyl methyl siloxane2037.Yasuhara, Shiraishi, et al., 199725. m/0.31 mm/0.52 μm, He; Program: 50C(2min) => (20C/min) => 120C => (7C/min) => 310C(10min)
CapillaryMethyl Silicone2015.Oda, Ichikawa, et al., 1996Program: 50C (2min) => 20C/min => 160C => 5C/min => 210C => 10C/min => 300C

Normal alkane RI, non-polar column, custom temperature program

View large format table.

Column type Active phase I Reference Comment
CapillaryHP-5MS2062.Vichi, Pizzale, et al., 200530. m/0.25 mm/0.25 μm; Program: 40C(3min) => 4C/min => 75C => 8C/min => 250C
CapillaryMethyl Silicone2028.Oda, Yasuhara, et al., 199825. m/0.25 mm/0.25 μm, He; Program: 50 0C (2 min) 20 0C/min -> 160 0C 5 0C/min -> 210 0C 10 0C/min -> 300 0C
CapillaryMethyl Silicone2006.Zenkevich, 1996Program: not specified
CapillaryPolydimethyl siloxane, unknown content of Ph-groups2084.Geldon, 1989Program: not specified
CapillaryPolydimethyl siloxane, unknown content of Ph-groups2085.Geldon, 1989Program: not specified
CapillaryOV-1, SE-30, Methyl silicone, SP-2100, OV-101, DB-1, etc.2030.Waggott and Davies, 1984Hydrogen; Column length: 50. m; Column diameter: 0.32 mm; Program: not specified
PackedOV-1012091.Kaliszan and Lamparczyk, 1978Program: not specified

Lee's RI, non-polar column, isothermal

View large format table.

Column type Active phase Temperature (C) I Reference Comment
PackedMethyl Silicone175.341.94Shlyakhov, 1984
PackedMethyl Silicone200.340.99Shlyakhov, 1984
PackedMethyl Silicone200.343.44Shlyakhov, 1984
PackedMethyl Silicone235.343.15Shlyakhov, 1984
PackedMethyl Silicone240.342.27Shlyakhov, 1984
PackedMethyl Silicone260.343.16Shlyakhov, 1984
PackedMethyl Silicone300.344.01Shlyakhov, 1984

Lee's RI, non-polar column, temperature ramp

View large format table.

Column type Active phase I Reference Comment
CapillaryPE-5344.3Jamoussi, Kanzari, et al., 200720. m/0.18 mm/0.18 μm, 50. C @ 1.5 min, 8. K/min; Tend: 345. C
CapillaryHP-5337.0Wang, Hou, et al., 200730. m/0.30 mm/0.25 μm, Helium, 50. C @ 5. min, 5. K/min, 200. C @ 15. min
CapillaryHP-5337.Shao, Wang, et al., 200630. m/0.3 mm/0.25 μm, He, 50. C @ 5. min, 5. K/min, 200. C @ 15. min
Capillary5 % Phenyl methyl siloxane344.01Skrbic and Onjia, 20062. K/min; Tstart: 50. C; Tend: 250. C
Capillary5 % Phenyl methyl siloxane340.90Skrbic and Onjia, 200680. C @ 2. min, 8. K/min, 300. C @ 10. min
CapillaryHP-5344.85Pedersen, Durant, et al., 200530. m/0.25 mm/0.25 μm, Helium, 50. C @ 1.5 min, 6. K/min, 310. C @ 10. min
CapillaryHP-5344.49Marynowski, Pieta, et al., 200460. m/0.25 mm/0.25 μm, He, 3. K/min; Tstart: 35. C; Tend: 300. C
CapillaryDB-5MS344.78Chen, Keeran, et al., 200230. m/0.25 mm/0.5 μm, 40. C @ 1. min, 10. K/min; Tend: 310. C
CapillaryDB-5MS344.83Chen, Keeran, et al., 200230. m/0.25 mm/0.5 μm, 40. C @ 1. min, 4. K/min; Tend: 310. C
CapillaryPTE-5344.99Wang, Jia, et al., 200030. m/0.25 mm/0.25 μm, 60. C @ 1.5 min, 8. K/min, 300. C @ 12.5 min
CapillaryHP-5344.49Miao and Wu, 199950. C @ 2. min, 5. K/min; Tend: 310. C
CapillaryHP-5344.51Miao and Wu, 199950. C @ 2. min, 5. K/min; Tend: 310. C
CapillaryHP-5344.56Miao and Wu, 199950. C @ 2. min, 5. K/min; Tend: 310. C
CapillaryHP-5344.60Miao and Wu, 199950. C @ 2. min, 5. K/min; Tend: 310. C
CapillaryHP-5344.64Miao and Wu, 199950. C @ 2. min, 5. K/min; Tend: 310. C
CapillaryHP-5344.67Miao and Wu, 199950. C @ 2. min, 5. K/min; Tend: 310. C
CapillaryHP-5344.74Miao and Wu, 199950. C @ 2. min, 5. K/min; Tend: 310. C
CapillaryHP-5344.75Miao and Wu, 199950. C @ 2. min, 5. K/min; Tend: 310. C
CapillaryHP-5344.54Piao, Chu, et al., 199930. m/0.25 mm/0.25 μm, 50. C @ 2. min, 4. K/min, 280. C @ 20. min
CapillaryHP-5344.68Piao, Chu, et al., 199930. m/0.25 mm/0.25 μm, 50. C @ 2. min, 4. K/min, 280. C @ 20. min
CapillaryDB-5344.8Durlak, Biswas, et al., 199830. m/0.25 mm/0.25 μm, 15. K/min; Tstart: 50. C; Tend: 300. C
CapillaryDB-5344.8Durlak, Biswas, et al., 199830. m/0.25 mm/0.25 μm, 15. K/min; Tstart: 50. C; Tend: 300. C
CapillarySE-54344.67Chen, 19964. K/min; Column length: 30. m; Column diameter: 0.25 mm; Tstart: 50. C; Tend: 300. C
CapillarySE-52344.85Shaogang and Xiaobai, 199440. C @ 2. min, 4. K/min, 300. C @ 20. min; Column length: 30. m; Column diameter: 0.25 mm
CapillaryDB-5344.8Donnelly, Abdel-Hamid, et al., 199330. m/0.32 mm/0.25 μm, He, 40. C @ 3. min, 8. K/min, 285. C @ 29.5 min
CapillarySPB-5345.0Knobloch and Engewald, 199340. C @ 2. min, 4. K/min; Column length: 30. m; Column diameter: 0.25 mm; Tend: 300. C
CapillarySE-54344.55Guillén, Blanco, et al., 198920. m/0.22 mm/0.20 μm, He, 4. K/min; Tstart: 50. C; Tend: 300. C
CapillarySE-52344.62Hasegawa, Muragishi, et al., 19883. K/min; Column length: 25. m; Column diameter: 0.25 mm; Tstart: 130. C; Tend: 260. C
CapillaryDB-5344.35Sye, Lin, et al., 198830. m/0.32 mm/0.25 μm, 80. C @ 1. min, 3. K/min; Tend: 290. C
CapillaryDB-5344.49Wise, Benner, et al., 198830. m/0.25 mm/0.25 μm, 40. C @ 2. min, 4. K/min, 280. C @ 5. min
CapillaryDB-5344.68Rostad and Pereira, 198630. m/0.26 mm/0.25 μm, He, 50. C @ 4. min, 6. K/min, 300. C @ 20. min
CapillaryDB-5344.43Tong, Centen, et al., 1985He, 4. K/min; Column length: 30. m; Column diameter: 0.25 mm; Tstart: 90. C; Tend: 325. C
PackedMethyl Silicone340.66Shlyakhov, 19842. K/min; Tstart: 100. C; Tend: 275. C
CapillaryDB-5344.560Tong, Shore, et al., 1984He, 80. C @ 1. min, 3. K/min, 300. C @ 10. min; Column length: 30. m; Column diameter: 0.32 mm
CapillaryDB-5344.7Viau, Studak, et al., 1984Helium, 4. K/min; Column length: 30. m; Column diameter: 0.32 mm; Tstart: 90. C; Tend: 250. C
CapillarySE-52344.51Vassilaros, Kong, et al., 198220. m/0.30 mm/0.25 μm, H2, 40. C @ 2. min, 4. K/min; Tend: 265. C
CapillarySE-52344.01Lee, Vassilaros, et al., 197912. m/0.3 mm/0.34 μm, He, 2. K/min; Tstart: 50. C; Tend: 250. C

References

Roux, Temprado, et al., 2008
Roux, M.V.; Temprado, M.; Chickos, J.S.; Nagano, Y.,
Critically Evaluated Thermochemical Properties of Polycyclic Aromatic Hydrocarbons,
J. Phys. Chem. Ref. Data, 2008, 37, 4, 1855-1996. [all data]
Westrum and Wong, 1967
Westrum, E.F., Jr.; Wong, S.,
Strain energies and thermal properties of globular and polynuclear aromatic molecules,
AEC Rept. Coo-1149-92, Contract AT(11-1)-1149, 1967, 1-7. [all data]
Boyd, Christensen, et al., 1965
Boyd, R.H.; Christensen, R.L.; Pua, R.,
The heats of combustion of acenaphthene, acenaphthylene, and fluoranthene. Strain and delocalization in bridged naphthalenes,
J. Am. Chem. Soc., 1965, 87, 3554-3559. [all data]
Cox and Pilcher, 1970
Cox, J.D.; Pilcher, G.,
Thermochemistry of Organic and Organometallic Compounds, Academic Press, New York, 1970, 1-636. [all data]
Dorofeeva O.V., 1989
Dorofeeva O.V.,
Thermodynamic Properties of Gaseous Polycyclic Aromatic Hydrocarbons Containing Five-Membered Rings. Institute for High Temperatures, USSR Academy of Sciences, Preprint No.1-263 (in Russian), Moscow, 1989. [all data]
Pope C.J., 1995
Pope C.J.,
Thermochemical properties of curved PAH and fullerenes: a group additivity method compared with MM3(92) and MOPAC predictions,
J. Phys. Chem., 1995, 99, 4306-4316. [all data]
Frenkel M., 1994
Frenkel M.,
Thermodynamics of Organic Compounds in the Gas State, Vol. I, II, Thermodynamics Research Center, College Station, Texas, 1994, 1994. [all data]
Wong and Westrum, 1971
Wong, W-K.; Westrum, E.F., Jr.,
Thermodynamics of polynuclear aromatic molecules. I. Heat capacities and enthalpies of fusion of pyrene, flouranthene, and triphenylene,
J. Chem. Thermodynam., 1971, 3, 105-124. [all data]
Casellato, Vecchi, et al., 1973
Casellato, F.; Vecchi, C.; Girell, A.,
Differential calorimetric study of polycyclic aromatic hydrocarbons,
Thermochim. Acta, 1973, 6, 4, 361, https://doi.org/10.1016/0040-6031(73)87003-0
. [all data]
Sangster and Irvine, 1956
Sangster, R.C.; Irvine, J.W.,
Study of Organic Scintillators,
J. Chem. Phys., 1956, 24, 670. [all data]
Schuyer, Blom, et al., 1953
Schuyer, J.; Blom, L.; Van Krevelen, D.W.,
Molar refraction of condensed aromatic compounds.,
Trans. Faraday Soc., 1953, 49, 1391. [all data]
Wong and Westrum, 1971, 2
Wong, W.-K.; Westrum, E.F.,
Thermodynamics of Polynuclear Aromatic Molecules. 1. Heat Capacities and Enthalpies of Fusion of Pyrene, Fluoranthene, and Triphenylene,
J. Chem. Thermodyn., 1971, 3, 105-24. [all data]
Ribeiro da Silva, Gomes, et al., 2005
Ribeiro da Silva, Manuel A.V.; Gomes, José R.B.; Ferreira, Ana I.M.C.L.,
Experimental and Computational Investigation of the Energetics of the Three Isomers of Monochloroaniline,
J. Phys. Chem. B, 2005, 109, 27, 13356-13362, https://doi.org/10.1021/jp0519565
. [all data]
Morawetz, 1972
Morawetz, E.,
Enthalpies of vaporization for a number of aromatic compounds,
J. Chem. Thermodyn., 1972, 4, 455. [all data]
Morawetz, 1972, 2
Morawetz, Ernst,
Enthalpies of vaporization for a number of aromatic compounds,
The Journal of Chemical Thermodynamics, 1972, 4, 3, 455-460, https://doi.org/10.1016/0021-9614(72)90029-8
. [all data]
Pedley and Rylance, 1977
Pedley, J.B.; Rylance, J.,
, Computer Analysed Thermochemical Data: Organic and Organometallic Compounds, University of Sussex, Brighton, 1977. [all data]
Lei, Chankalal, et al., 2002
Lei, Ying Duan; Chankalal, Raymond; Chan, Anita; Wania, Frank,
Supercooled Liquid Vapor Pressures of the Polycyclic Aromatic Hydrocarbons,
J. Chem. Eng. Data, 2002, 47, 4, 801-806, https://doi.org/10.1021/je0155148
. [all data]
Hinckley, Bidleman, et al., 1990
Hinckley, Daniel A.; Bidleman, Terry F.; Foreman, William T.; Tuschall, Jack R.,
Determination of vapor pressures for nonpolar and semipolar organic compounds from gas chromatograhic retention data,
J. Chem. Eng. Data, 1990, 35, 3, 232-237, https://doi.org/10.1021/je00061a003
. [all data]
Stephenson and Malanowski, 1987
Stephenson, Richard M.; Malanowski, Stanislaw,
Handbook of the Thermodynamics of Organic Compounds, 1987, https://doi.org/10.1007/978-94-009-3173-2
. [all data]
Tsypikina and Ya, 1955
Tsypikina, O.; Ya, J.,
J. Appl. Chem. USSR, 1955, 28, 167. [all data]
Tsypkina, 1955
Tsypkina, O.Y.,
Study of Vacuum Pressure Influence on Efficiency of Separation of Some Polynuclear Compounds of Coal Tar Rectifications,
Zh. Prikl. Khim. (Moscow), 1955, 28, 2, 185-192. [all data]
Nass, Lenoir, et al., 1995
Nass, Karen; Lenoir, Dieter; Kettrup, Antonius,
Calculation of the Thermodynamic Properties of Polycyclic Aromatic Hydrocarbons by an Incremental Procedure,
Angew. Chem. Int. Ed. Engl., 1995, 34, 16, 1735-1736, https://doi.org/10.1002/anie.199517351
. [all data]
Sonnefeld, Zoller, et al., 1983
Sonnefeld, W.J.; Zoller, W.H.; May, W.E.,
Dynamic coupled-column liquid-chromatographic determination of ambient-temperature vapor pressures of polynuclear aromatic hydrocarbons,
Anal. Chem., 1983, 55, 2, 275-280, https://doi.org/10.1021/ac00253a022
. [all data]
Cox and Pilcher, 1970, 2
Cox, J.D.; Pilcher, G.,
Thermochemistry of Organic and Organometallic Compounds, Academic Press Inc., London, 1970, 643. [all data]
Hoyer and Peperle, 1958
Hoyer, H.; Peperle, W.,
Z. Elektrochem., 1958, 62, 61. [all data]
Domalski and Hearing, 1996
Domalski, Eugene S.; Hearing, Elizabeth D.,
Heat Capacities and Entropies of Organic Compounds in the Condensed Phase. Volume III,
J. Phys. Chem. Ref. Data, 1996, 25, 1, 1, https://doi.org/10.1063/1.555985
. [all data]
Hunter and Lias, 1998
Hunter, E.P.; Lias, S.G.,
Evaluated Gas Phase Basicities and Proton Affinities of Molecules: An Update,
J. Phys. Chem. Ref. Data, 1998, 27, 3, 413-656, https://doi.org/10.1063/1.556018
. [all data]
Michl, 1969
Michl, J.,
Electronic Spectrum of Fluoranthene,
J. Molec. Spectros., 1969, 30, 1-3, 66, https://doi.org/10.1016/0022-2852(69)90236-7
. [all data]
Aue, Guidoni, et al., 2000
Aue, D.H.; Guidoni, M.; Betowski, L.D.,
Ab initio calculated gas-phase basicities of polynuclear aromatic hydrocarbons,
Int. J. Mass Spectrom., 2000, 201, 283. [all data]
Ling and Lifshitz, 1995
Ling, Y.; Lifshitz, C.,
Time-dependent mass spectra and breakdown graphs. 19. Fluoranthene,
J. Phys. Chem., 1995, 99, 11074. [all data]
Boschi, Clar, et al., 1974
Boschi, R.; Clar, E.; Schmidt, W.,
Photoelectron spectra of polynuclear aromatics. III. The effect of nonplanarity in sterically overcrowded aromatic hydrocarbons,
J. Chem. Phys., 1974, 60, 4406. [all data]
Dewar, Haselbach, et al., 1970
Dewar, M.J.S.; Haselbach, E.; Worley, S.D.,
Calculated and observed ionization potentials of unsaturated polycyclic hydrocarbons; calculated heats of formation by several semiempirical s.c.f. m.o. methods,
Proc. Roy. Soc. (London), 1970, A315, 431. [all data]
Slifkin and Allison, 1967
Slifkin, M.A.; Allison, A.C.,
Measurement of ionization potentials from contact charge transfer spectra,
Nature, 1967, 215, 949. [all data]
Streitwieser and Suzuki, 1961
Streitwieser, A., Jr.; Suzuki, S.,
An HMO treatment of the reduction of aromatic hydrocarbons with alkali metals; reduction of fluoranthene,
Tetrahedron, 1961, 16, 153-168. [all data]