Benzenebutanoic acid, 4-amino-, methyl ester
- Formula: C11H15NO2
- Molecular weight: 193.2423
- IUPAC Standard InChIKey: CLKHQWJXESOLCJ-UHFFFAOYSA-N
- CAS Registry Number: 20637-09-6
- Chemical structure:
View 3d structure (requires JavaScript / HTML 5) - Other names: Butyric acid, 4-(p-aminophenyl)-, methyl ester; Methyl 4-(4-aminophenyl)butyrate; Methyl 4-aminobenzenebutanoate; Methyl 4-(4-aminophenyl)butanoate; 4-(4-Aminophenyl)butanoic acid methyl ester

Gas phase ion energetics data

Data compiled by: Henry M. Rosenstock, Keith Draxl, Bruce W. Steiner, and John T. Herron
Ionization energy determinations
IE (eV) | Method | Reference |
---|---|---|
7.9 ± 0.2 | EI | Howe, Williams, et al., 1969 |
Appearance energy determinations
Ion | AE (eV) | Other Products | Method | Reference | Comment |
---|---|---|---|---|---|
C7H8N+ | 10.9 ± 0.2 | ? | EI | Howe, Williams, et al., 1969 | |
C8H9N+ | 10.5 ± 0.2 | ? | EI | Howe, Williams, et al., 1969 | |
C10H12NO+ | 11.3 ± 0.2 | CH3O | EI | Howe, Williams, et al., 1969 |

References

Howe, Williams, et al., 1969
Howe, I.; Williams, D.H.; Kingston, D.G.I.; Tannenbaum, H.P.,
Substituent effects in the mass spectra of some - and -substituted methyl butyrates,
J. Chem. Soc. B, 1969, 439. [all data]