4-(4-Biphenylyl)butanoic acid methyl ester
- Formula: C17H18O2
- Molecular weight: 254.3236
- IUPAC Standard InChIKey: ZKYIDZVHHNPNSZ-UHFFFAOYSA-N
- CAS Registry Number: 20637-07-4
- Chemical structure:
View 3d structure (requires JavaScript / HTML 5) - Permanent link for this species. Use this link for bookmarking this species for future reference.

Gas phase ion energetics data

Data compiled by: Henry M. Rosenstock, Keith Draxl, Bruce W. Steiner, and John T. Herron
Ionization energy determinations
IE (eV) | Method | Reference |
---|---|---|
8.3 ± 0.2 | EI | Howe, Williams, et al., 1969 |
Appearance energy determinations
Ion | AE (eV) | Other Products | Method | Reference | Comment |
---|---|---|---|---|---|
C3H6O2+ | 11.5 ± 0.2 | ? | EI | Howe, Williams, et al., 1969 | |
C13H11+ | 12.2 ± 0.2 | ? | EI | Howe, Williams, et al., 1969 | |
C14H12+ | 10.9 ± 0.2 | ? | EI | Howe, Williams, et al., 1969 | |
C16H15O+ | 11.2 ± 0.2 | CH3O | EI | Howe, Williams, et al., 1969 |

References

Howe, Williams, et al., 1969
Howe, I.; Williams, D.H.; Kingston, D.G.I.; Tannenbaum, H.P.,
Substituent effects in the mass spectra of some - and -substituted methyl butyrates,
J. Chem. Soc. B, 1969, 439. [all data]