Butyric acid, 4-(p-fluorophenyl)-, methyl ester
- Formula: C11H13FO2
- Molecular weight: 196.2181
- IUPAC Standard InChIKey: OZOJNBOWCVAQPW-UHFFFAOYSA-N
- CAS Registry Number: 20637-05-2
- Chemical structure:
View 3d structure (requires JavaScript / HTML 5) - Other names: Methyl 4-(4-fluorophenyl)butanoate; 4-(4-Fluorophenyl)butanoic acid methyl ester

Gas phase ion energetics data

Data compiled by: Henry M. Rosenstock, Keith Draxl, Bruce W. Steiner, and John T. Herron
Ionization energy determinations
IE (eV) | Method | Reference |
---|---|---|
8.8 ± 0.2 | EI | Howe, Williams, et al., 1969 |
Appearance energy determinations
Ion | AE (eV) | Other Products | Method | Reference | Comment |
---|---|---|---|---|---|
C3H6O2+ | 11.3 ± 0.2 | ? | EI | Howe, Williams, et al., 1969 | |
C7H6F+ | 13.4 ± 0.2 | ? | EI | Howe, Williams, et al., 1969 | |
C8H7F+ | 10.7 ± 0.2 | ? | EI | Howe, Williams, et al., 1969 | |
C10H9OF+ | 9.4 ± 0.2 | CH3OH | EI | Howe, Williams, et al., 1969 | |
C10H10OF+ | 11.2 ± 0.2 | CH3O | EI | Howe, Williams, et al., 1969 |

References

Howe, Williams, et al., 1969
Howe, I.; Williams, D.H.; Kingston, D.G.I.; Tannenbaum, H.P.,
Substituent effects in the mass spectra of some - and -substituted methyl butyrates,
J. Chem. Soc. B, 1969, 439. [all data]