4-(4-Cyanophenyl)butanoic acid methyl ester
- Formula: C12H13NO2
- Molecular weight: 203.2371
- IUPAC Standard InChIKey: LUGWUGOOOXSQFQ-UHFFFAOYSA-N
- CAS Registry Number: 20637-03-0
- Chemical structure:
View 3d structure (requires JavaScript / HTML 5) - Permanent link for this species. Use this link for bookmarking this species for future reference.

Gas phase ion energetics data

Data compiled by: Henry M. Rosenstock, Keith Draxl, Bruce W. Steiner, and John T. Herron
Ionization energy determinations
IE (eV) | Method | Reference |
---|---|---|
9.3 ± 0.2 | EI | Howe, Williams, et al., 1969 |
Appearance energy determinations
Ion | AE (eV) | Other Products | Method | Reference | Comment |
---|---|---|---|---|---|
C3H6O2+ | 11.1 ± 0.2 | ? | EI | Howe, Williams, et al., 1969 | |
C9H7N+ | 11.2 ± 0.2 | ? | EI | Howe, Williams, et al., 1969 | |
C11H9NO+ | 9.6 ± 0.2 | CH3OH | EI | Howe, Williams, et al., 1969 | |
C11H10NO+ | 11.2 ± 0.2 | CH3O | EI | Howe, Williams, et al., 1969 |

References

Howe, Williams, et al., 1969
Howe, I.; Williams, D.H.; Kingston, D.G.I.; Tannenbaum, H.P.,
Substituent effects in the mass spectra of some - and -substituted methyl butyrates,
J. Chem. Soc. B, 1969, 439. [all data]