Benzenebutanoic acid, 4-nitro-, methyl ester
- Formula: C11H13NO4
- Molecular weight: 223.2252
- IUPAC Standard InChIKey: IIDUVWAKHMUVPN-UHFFFAOYSA-N
- CAS Registry Number: 20637-02-9
- Chemical structure:
View 3d structure (requires JavaScript / HTML 5) - Other names: Butyric acid, 4-(p-nitrophenyl)-, methyl ester; Methyl 4-(4-nitrophenyl)butanoate; 4-(4-Nitrophenyl)butanoic acid methyl ester

Gas phase ion energetics data

Data compiled by: Henry M. Rosenstock, Keith Draxl, Bruce W. Steiner, and John T. Herron
Ionization energy determinations
IE (eV) | Method | Reference |
---|---|---|
9.3 ± 0.2 | EI | Howe, Williams, et al., 1969 |
8.9 ± 0.3 | EI | Howe and Williams, 1968 |
Appearance energy determinations
Ion | AE (eV) | Other Products | Method | Reference | Comment |
---|---|---|---|---|---|
C3H6O2+ | 11.1 ± 0.2 | ? | EI | Howe, Williams, et al., 1969 | |
C7H6NO2+ | 14.0 ± 0.2 | ? | EI | Howe, Williams, et al., 1969 | |
C8H7NO2+ | 11.2 ± 0.2 | ? | EI | Howe, Williams, et al., 1969 | |
C10H10NO3+ | 11.2 ± 0.2 | CH3O | EI | Howe, Williams, et al., 1969 |

References

Howe, Williams, et al., 1969
Howe, I.; Williams, D.H.; Kingston, D.G.I.; Tannenbaum, H.P.,
Substituent effects in the mass spectra of some - and -substituted methyl butyrates,
J. Chem. Soc. B, 1969, 439. [all data]
Howe and Williams, 1968
Howe, I.; Williams, D.H.,
Studies in mass spectrometry. XXX. Substituent effects in mass spectrometry. Comparison of charge localization and quasi-equilibrium theories,
J. Am. Chem. Soc., 1968, 90, 5461. [all data]