1,3-Dioxolan-2-thione
- Formula: C3H4O2S
- Molecular weight: 104.128
- IUPAC Standard InChIKey: NLLOEPZYASPYON-UHFFFAOYSA-N
- CAS Registry Number: 20628-59-5
- Chemical structure:
View 3d structure (requires JavaScript / HTML 5) - Permanent link for this species. Use this link for bookmarking this species for future reference.

Gas phase ion energetics data

Data compiled as indicated in comments:
LLK - Sharon G. Lias, Rhoda D. Levin, and Sherif A. Kafafi
Ionization energy determinations
IE (eV) | Method | Reference | Comment |
---|---|---|---|
8.6 | PE | Wittel, Astrup, et al., 1975 | LLK |
8.88 | PE | Wittel, Astrup, et al., 1975 | Vertical value; LLK |

References

Wittel, Astrup, et al., 1975
Wittel, K.; Astrup, E.E.; Bock, H.; Graeffe, G.; Juslen, H.,
Photoelectron spectra and molecular properties, XLVIII Carbonates thio- carbonates,
Z. Naturforsch. B:, 1975, 30, 862. [all data]