2-Pentynoic acid, 4,4-dimethyl, methyl ester
- Formula: C8H12O2
- Molecular weight: 140.1797
- IUPAC Standard InChIKey: SULMXENENMCVFF-UHFFFAOYSA-N
- CAS Registry Number: 20607-85-6
- Chemical structure:
View 3d structure (requires JavaScript / HTML 5) - Permanent link for this species. Use this link for bookmarking this species for future reference.

Gas phase ion energetics data

Data compiled by: Sharon G. Lias, John E. Bartmess, Joel F. Liebman, John L. Holmes, Rhoda D. Levin, and W. Gary Mallard
Ionization energy determinations
IE (eV) | Method | Reference |
---|---|---|
9.64 | PI | Orlov, Boganov, et al., 1985 |
Appearance energy determinations
Ion | AE (eV) | Other Products | Method | Reference | Comment |
---|---|---|---|---|---|
C7H9O2+ | 9.66 | CH3 | PI | Orlov, Boganov, et al., 1985 |

References

Orlov, Boganov, et al., 1985
Orlov, V.M.; Boganov, A.M.; Siretskaya, T.V.; Takhistov, V.V.,
Thermochemical characteristics of the molecular and fragmentation ions of substituted tert-butylacetylenes,
Izv. Akad. Nauk SSSR Ser. Khim., 1985, 12, 2795. [all data]