Sulfur diimide, bis(1,1-dimethylethyl)-

Gas phase ion energetics data

Data compiled by: Sharon G. Lias, Rhoda D. Levin, and Sherif A. Kafafi

Ionization energy determinations

IE (eV) Method Reference Comment
8.65PEKroner, Strack, et al., 1973Vertical value

References

Kroner, Strack, et al., 1973
Kroner, J.; Strack, W.; Holsboer, F.; Kosbahn, W., Zur elektronenstruktur der thiokumulene, Z. Naturforsch. B:, 1973, 28, 188. [all data]