Methanimine
- Formula: CH3N
- Molecular weight: 29.0412
- IUPAC Standard InChIKey: WDWDWGRYHDPSDS-UHFFFAOYSA-N
- CAS Registry Number: 2053-29-4
- Chemical structure:
View 3d structure (requires JavaScript / HTML 5) - Permanent link for this species. Use this link for bookmarking this species for future reference.

Gas phase thermochemistry data

Data compiled by: Hussein Y. Afeefy, Joel F. Liebman, and Stephen E. Stein
Quantity | Value | Units | Method | Reference | Comment |
---|---|---|---|---|---|
ΔfH°gas | 69. ± 8. | kJ/mol | Ion | Peerboom, Ingemann, et al., 1990 | Appearance potentials |
ΔfH°gas | 110. ± 8. | kJ/mol | Ion | Grela and Colussi, 1988 | |
ΔfH°gas | 110. ± 13. | kJ/mol | Ion | DeFrees and Hehre, 1978 | ion cyclotron resonance |

Reaction thermochemistry data

Data compiled by: John E. Bartmess
Individual Reactions
CH2N- + =
Quantity | Value | Units | Method | Reference | Comment |
---|---|---|---|---|---|
ΔrH° | 1625. ± 21. | kJ/mol | G+TS | Kass and DePuy, 1985 | gas phase |
Quantity | Value | Units | Method | Reference | Comment |
ΔrG° | 1594. ± 21. | kJ/mol | IMRB | Kass and DePuy, 1985 | gas phase |
(CAS Reg. No. 54448-39-4 • 4294967295) +
= CAS Reg. No. 54448-39-4
By formula: (CAS Reg. No. 54448-39-4 • 4294967295CH3N) + CH3N = CAS Reg. No. 54448-39-4
Quantity | Value | Units | Method | Reference | Comment |
---|---|---|---|---|---|
ΔrH° | 99. ± 17. | kJ/mol | N/A | MacKay, Hemsworth, et al., 1976 | gas phase |

Gas phase ion energetics data

Data evaluated as indicated in comments:
HL - Edward P. Hunter and Sharon G. Lias
Data compiled as indicated in comments:
B - John E. Bartmess
LBLHLM - Sharon G. Lias, John E. Bartmess, Joel F. Liebman, John L. Holmes, Rhoda D. Levin, and W. Gary Mallard
LLK - Sharon G. Lias, Rhoda D. Levin, and Sherif A. Kafafi
Quantity | Value | Units | Method | Reference | Comment |
---|---|---|---|---|---|
Proton affinity (review) | 852.9 | kJ/mol | N/A | Hunter and Lias, 1998 | HL |
Quantity | Value | Units | Method | Reference | Comment |
Gas basicity | 818.7 | kJ/mol | N/A | Hunter and Lias, 1998 | HL |
Ionization energy determinations
IE (eV) | Method | Reference | Comment |
---|---|---|---|
9.97 | PE | Bock and Dammel, 1987 | LBLHLM |
9.88 ± 0.07 | PI | Tarasenko, Tishenkov, et al., 1986 | LBLHLM |
~10.0 | PE | Peel and Willett, 1975 | LLK |
10.7 | PE | Bock and Dammel, 1987 | Vertical value; LBLHLM |
De-protonation reactions
CH2N- + =
Quantity | Value | Units | Method | Reference | Comment |
---|---|---|---|---|---|
ΔrH° | 1625. ± 21. | kJ/mol | G+TS | Kass and DePuy, 1985 | gas phase; B |
Quantity | Value | Units | Method | Reference | Comment |
ΔrG° | 1594. ± 21. | kJ/mol | IMRB | Kass and DePuy, 1985 | gas phase; B |

References

Peerboom, Ingemann, et al., 1990
Peerboom, R.A.L.; Ingemann, S.; Nibbering, N.M.M.; Liebman, J.F.,
Proton affinities and heats of formation of the imines CH2=NH, CH2=NMe and PhCH=NH,
J. Chem. Soc. Perkin Trans. 2, 1990, 1825-1828. [all data]
Grela and Colussi, 1988
Grela, M.A.; Colussi, A.J.,
Decomposition of methylamino and aminomethyl radicals. The heats of formation of methyleneimine (CH2=NH) and hydrazyl (N2H3) radical,
Int. J. Chem. Kinet., 1988, 20, 713-718. [all data]
DeFrees and Hehre, 1978
DeFrees, D.J.; Hehre, W.J.,
Methyleneimine,
J. Phys. Chem., 1978, 82, 391-393. [all data]
Kass and DePuy, 1985
Kass, S.R.; DePuy, C.H.,
Gas phase ion chemistry of azides. The generation of CH=N- and CH2=NCH2-,
J. Org. Chem., 1985, 50, 2874. [all data]
MacKay, Hemsworth, et al., 1976
MacKay, G.J.; Hemsworth, R.S.; Bohme, D.K.,
Absolute gas-phase acidities of CH3NH2, C2H5NH2, (CH3)2NH, and (CH3)3N,
Can. J. Chem., 1976, 54, 1624. [all data]
Hunter and Lias, 1998
Hunter, E.P.; Lias, S.G.,
Evaluated Gas Phase Basicities and Proton Affinities of Molecules: An Update,
J. Phys. Chem. Ref. Data, 1998, 27, 3, 413-656, https://doi.org/10.1063/1.556018
. [all data]
Bock and Dammel, 1987
Bock, H.; Dammel, R.,
Methanimine RR"C=NR": Darstellung und photoelektronen-spektren,
J. Am. Chem. Soc., 1987, 120, 1961. [all data]
Tarasenko, Tishenkov, et al., 1986
Tarasenko, N.A.; Tishenkov, A.A.; Zaikin, V.G.; Volkova, V.V.; Gusel'nikov, L.E.,
Adiabatic ionization energy of methylenimine,
Bull. Acad. Sci. USSR, Div. Chem. Sci., 1986, 10, 2196. [all data]
Peel and Willett, 1975
Peel, J.B.; Willett, G.D.,
Photoelectron spectrum of methylenimine by spectrum stripping,
J. Chem. Soc. Faraday Trans. 2, 1975, 71, 1799. [all data]