1,1'-Biphenyl, 2-chloro-
- Formula: C12H9Cl
- Molecular weight: 188.653
- IUPAC Standard InChIKey: LAXBNTIAOJWAOP-UHFFFAOYSA-N
- CAS Registry Number: 2051-60-7
- Chemical structure:
View 3d structure (requires JavaScript / HTML 5) - Other names: Biphenyl, 2-chloro-; o-Chlorobiphenyl; 2-Chloro-1,1'-biphenyl; 2-Chlorobiphenyl; 2-Chlorodiphenyl; 2-Monochlorobiphenyl; o-Chlorodiphenyl; 1-Chloro-2-phenylbenzene; PCB 1; NSC 67354

Condensed phase thermochemistry data

Data compiled as indicated in comments:
ALS - Hussein Y. Afeefy, Joel F. Liebman, and Stephen E. Stein
DH - Eugene S. Domalski and Elizabeth D. Hearing
Quantity | Value | Units | Method | Reference | Comment |
---|---|---|---|---|---|
ΔcH°liquid | -6072.07 | kJ/mol | Ccb | Brull, 1935 | ALS |
Quantity | Value | Units | Method | Reference | Comment |
S°solid,1 bar | 303.76 | J/mol*K | N/A | Geidarov, Dzhafarov, et al., 1974 | DH |
S°solid,1 bar | 254.30 | J/mol*K | N/A | Geidarov, Karasharli, et al., 1977 | DH |
Constant pressure heat capacity of solid
Cp,solid (J/mol*K) | Temperature (K) | Reference | Comment |
---|---|---|---|
211.92 | 298.15 | Geidarov, Karasharli, et al., 1977 | Based on previously published work of authors, not available in detail, on Cp 12 to 370 K.; DH |
208.03 | 298.15 | Geidarov, Dzhafarov, et al., 1974 | T = 12 to 330 K.; DH |

Phase change data

Data compiled as indicated in comments:
BS - Robert L. Brown and Stephen E. Stein
TRC - Thermodynamics Research Center, NIST Boulder Laboratories, Chris Muzny director
AC - William E. Acree, Jr., James S. Chickos
DH - Eugene S. Domalski and Elizabeth D. Hearing
Quantity | Value | Units | Method | Reference | Comment |
---|---|---|---|---|---|
Tboil | 547.2 | K | N/A | Weast and Grasselli, 1989 | BS |
Quantity | Value | Units | Method | Reference | Comment |
Tfus | 305.3 | K | N/A | Miller, Ghodbane, et al., 1984 | Uncertainty assigned by TRC = 0.2 K; TRC |
Quantity | Value | Units | Method | Reference | Comment |
Ttriple | 304.94 | K | N/A | Geidarov, Karasharli, et al., 1977, 2 | Uncertainty assigned by TRC = 0.02 K; TRC |
Ttriple | 304.94 | K | N/A | Geidarov, Dzhafarov, et al., 1974, 2 | Uncertainty assigned by TRC = 0.02 K; TRC |
Quantity | Value | Units | Method | Reference | Comment |
ΔvapH° | 72.1 ± 2.0 | kJ/mol | CGC | Puri, Chickos, et al., 2001 | AC |
Enthalpy of vaporization
ΔvapH (kJ/mol) | Temperature (K) | Method | Reference | Comment |
---|---|---|---|---|
64.4 | 368. | GC | Falconer and Bidleman, 1994 | Based on data from 343. to 393. K.; AC |
57.8 | 424. | A | Stephenson and Malanowski, 1987 | Based on data from 409. to 540. K.; AC |
61.1 | 377. | A | Stephenson and Malanowski, 1987 | Based on data from 362. to 541. K. See also Stull, 1947.; AC |
74.5 | 328. | ME | Ferro, Piacente, et al., 1983 | Based on data from 306. to 350. K.; AC |
55.8 | 424. | QM | Geidarov, Dzhafarov, et al., 1975 | Based on data from 410. to 540. K.; AC |
Antoine Equation Parameters
log10(P) = A − (B / (T + C))
P = vapor pressure (bar)
T = temperature (K)
View plot Requires a JavaScript / HTML 5 canvas capable browser.
Temperature (K) | A | B | C | Reference | Comment |
---|---|---|---|---|---|
362.5 to 540.7 | 5.50581 | 2877.437 | -18.667 | Stull, 1947 | Coefficents calculated by NIST from author's data. |
Enthalpy of fusion
ΔfusH (kJ/mol) | Temperature (K) | Reference | Comment |
---|---|---|---|
14.518 | 304.94 | Geidarov, Dzhafarov, et al., 1974 | DH |
14.518 | 304.94 | Geidarov, Karasharli, et al., 1977 | DH |
14.54 | 304.9 | Acree, 1991 | AC |
Entropy of fusion
ΔfusS (J/mol*K) | Temperature (K) | Reference | Comment |
---|---|---|---|
47.61 | 304.94 | Geidarov, Dzhafarov, et al., 1974 | DH |
47.61 | 304.94 | Geidarov, Karasharli, et al., 1977 | DH |

Gas phase ion energetics data

Data compiled by: Sharon G. Lias, Rhoda D. Levin, and Sherif A. Kafafi
Ionization energy determinations
IE (eV) | Method | Reference |
---|---|---|
8.20 ± 0.02 | PE | Maier and Turner, 1972 |

Kovats' RI, non-polar column, isothermal

Column type | Active phase | Temperature (C) | I | Reference | Comment |
---|---|---|---|---|---|
Packed | OV-101 | 200. | 1508. | Albro, Haseman, et al., 1977 | Chromosorb W HP (80-100 mesh); Column length: 3. m |

Van Den Dool and Kratz RI, non-polar column, temperature ramp

Column type | Active phase | I | Reference | Comment |
---|---|---|---|---|
Capillary | Methyl Silicone | 1465. | Kozloski, 1985 | He, 5. K/min; Column length: 10. m; Column diameter: 0.21 mm; Tstart: 60. C; Tend: 210. C |

Normal alkane RI, non-polar column, isothermal

Column type | Active phase | Temperature (C) | I | Reference | Comment |
---|---|---|---|---|---|
Capillary | Apiezon L | 180. | 1538. | Ballschmiter and Zell, 1980 | H2; Column length: 40. m; Column diameter: 0.30 mm |
Capillary | Apiezon L | 180. | 1538. | Ballschmiter and Zell, 1980 | H2; Column length: 40. m; Column diameter: 0.30 mm |

Normal alkane RI, non-polar column, temperature ramp

Column type | Active phase | I | Reference | Comment |
---|---|---|---|---|
Capillary | HP-5 | 1482. | Zenkevich, Moeder, et al., 2004 | 30. m/0.25 mm/0.25 μm, Helium, 50. C @ 3. min, 3. K/min, 280. C @ 20. min |
Capillary | SPB-1 | 1494. | Nakano, Tsuji, et al., 1987 | 30. m/0.25 mm/0.25 μm, 4. K/min; Tstart: 130. C; Tend: 280. C |

Normal alkane RI, non-polar column, custom temperature program

Column type | Active phase | I | Reference | Comment |
---|---|---|---|---|
Capillary | Methyl Silicone | 1485. | Castello and Testini, 1996 | Program: not specified |
Capillary | Polydimethyl siloxanes | 1461. | Zenkevich and Chupalov, 1996 | Program: not specified |
Capillary | Apolane | 1459. | Bush, Murphy, et al., 1985 | He; Column length: 50. m; Column diameter: 0.25 mm; Program: 70 0C (2 min) 10 0C/min (6 min) 2 0C/min -> 250 0C |
Capillary | Apolane | 1466. | Bush, Murphy, et al., 1985 | He; Column length: 50. m; Column diameter: 0.25 mm; Program: 70 0C (2 min) 10 0C/min (6 min) 2 0C/min -> 250 0C |

References

Brull, 1935
Brull, L.,
Sui calori di combustione di alcuni derivati del bifenil,
Gazz. Chim. Ital., 1935, 65, 19-28. [all data]
Geidarov, Dzhafarov, et al., 1974
Geidarov, Kh.I.; Dzhafarov, O.I.; Karasharli, K.A.; Kostryukov, V.N.,
The heat capacity of 2-chlorobinphenyl in the range 12-327 K,
Zhur. Fiz. Khim., 1974, 48, 1147-1149. [all data]
Geidarov, Karasharli, et al., 1977
Geidarov, Kh.I.; Karasharli, K.A.; Dzhafarov, O.I.,
Analysis of the results of the thermodynamic investigation of diphenyl derivatives,
Azerb. Khim. Zhur., 1977, (5), 112-115. [all data]
Weast and Grasselli, 1989
CRC Handbook of Data on Organic Compounds, 2nd Editon, Weast,R.C and Grasselli, J.G., ed(s)., CRC Press, Inc., Boca Raton, FL, 1989, 1. [all data]
Miller, Ghodbane, et al., 1984
Miller, M.M.; Ghodbane, S.; Wasik, S.P.; Tewari, Y.B.; Martire, D.E.,
Aqueous Solubilities, Octanol/Water Partition Coefficients, and Entropies of Melting of Chlorinated Benzenes and Biphenyls,
J. Chem. Eng. Data, 1984, 29, 184-190. [all data]
Geidarov, Karasharli, et al., 1977, 2
Geidarov, K.I.; Karasharli, K.A.; Dzhafarov, O.I.,
Analysis of the results of the thermodynamic investigation of diphenyl devivatives,
Azerb. Khim. Zh., 1977, 1977, 112-5. [all data]
Geidarov, Dzhafarov, et al., 1974, 2
Geidarov, K.I.; Dzhafarov, O.I.; Karasharli, K.A.; Kostryukov, V.N.,
The heat capacity of 2-chlorobiphenyl in the range 12 - 327 k,
Zh. Fiz. Khim., 1974, 48, 1147-9. [all data]
Puri, Chickos, et al., 2001
Puri, Swati; Chickos, James S.; Welsh, William J.,
Determination of Vaporization Enthalpies of Polychlorinated Biphenyls by Correlation Gas Chromatography,
Anal. Chem., 2001, 73, 7, 1480-1484, https://doi.org/10.1021/ac001246p
. [all data]
Falconer and Bidleman, 1994
Falconer, Renee L.; Bidleman, Terry F.,
Vapor pressures and predicted particle/gas distributions of polychlorinated biphenyl congeners as functions of temperature and ortho-chlorine substitution,
Atmospheric Environment, 1994, 28, 3, 547-554, https://doi.org/10.1016/1352-2310(94)90130-9
. [all data]
Stephenson and Malanowski, 1987
Stephenson, Richard M.; Malanowski, Stanislaw,
Handbook of the Thermodynamics of Organic Compounds, 1987, https://doi.org/10.1007/978-94-009-3173-2
. [all data]
Stull, 1947
Stull, Daniel R.,
Vapor Pressure of Pure Substances. Organic and Inorganic Compounds,
Ind. Eng. Chem., 1947, 39, 4, 517-540, https://doi.org/10.1021/ie50448a022
. [all data]
Ferro, Piacente, et al., 1983
Ferro, Daniela; Piacente, Vincenzo; Scardala, Paolo,
Torsion---Knudsen effusion vapour-pressure measurement of o, m and p-chlorobiphenyls,
Thermochimica Acta, 1983, 68, 2-3, 329-339, https://doi.org/10.1016/0040-6031(83)80235-4
. [all data]
Geidarov, Dzhafarov, et al., 1975
Geidarov, K.I.; Dzhafarov, O.I.; Karasharli, K.A.,
Russ. J. Phys. Chem., 1975, 49, 197. [all data]
Acree, 1991
Acree, William E.,
Thermodynamic properties of organic compounds: enthalpy of fusion and melting point temperature compilation,
Thermochimica Acta, 1991, 189, 1, 37-56, https://doi.org/10.1016/0040-6031(91)87098-H
. [all data]
Maier and Turner, 1972
Maier, J.P.; Turner, D.W.,
Steric inhibition of resonance studied by molecular photoelectron spectroscopy. Part I. Biphenyls,
Faraday Discuss. Chem. Soc., 1972, 54, 149. [all data]
Albro, Haseman, et al., 1977
Albro, P.W.; Haseman, J.K.; Clemmer, T.A.; Corbett, B.J.,
Identification of the Individual Polychlorinated Biphenyls in a Mixture by Gas-Liquid Chromatography,
J. Chromatogr., 1977, 136, 1, 147-153, https://doi.org/10.1016/S0021-9673(00)83003-4
. [all data]
Kozloski, 1985
Kozloski, R.P.,
Polychlorinated biphenyl retention time standards obtained by chemical dechlorination of polychlorinated biphenyl isomers,
J. Chromatogr., 1985, 318, 211-219, https://doi.org/10.1016/S0021-9673(01)90682-X
. [all data]
Ballschmiter and Zell, 1980
Ballschmiter, K.; Zell, M.,
Analysis of polychlorinated biphenyls (PCB) by glass capillary gas chromatography,
Fresenius Z. Anal. Chem., 1980, 302, 1, 20-31, https://doi.org/10.1007/BF00469758
. [all data]
Zenkevich, Moeder, et al., 2004
Zenkevich, I.G.; Moeder, M.; Koeller, G.; Schrader, S.,
Using new structurally related additive schemes in the precalculation of gas chromatographic retention indices of polychlorinated hydroxybiphenyls on HP-5 stationary phase,
J. Chromatogr. A, 2004, 1025, 2, 227-236, https://doi.org/10.1016/j.chroma.2003.10.106
. [all data]
Nakano, Tsuji, et al., 1987
Nakano, T.; Tsuji, M.; Okuno, T.,
Analytical methods for PCB using GC/ECD and GC/MS with capillary column,
Report of the Environmental Science Institute of Hyoho Prefecture, 1987, 19, 57-62. [all data]
Castello and Testini, 1996
Castello, G.; Testini, G.,
Determination of retention indices of polychlorobiphenyls by using other compounds detectable by electron-capture detection or selected polychlorobiphenyls as the reference series,
J. Chromatogr. A, 1996, 741, 2, 241-249, https://doi.org/10.1016/0021-9673(96)00160-4
. [all data]
Zenkevich and Chupalov, 1996
Zenkevich, I.G.; Chupalov, A.A.,
New Possibilities of Chromato Mass Pectrometric Identification of Organic Compounds Using Increments of Gas Chromatographic Retention Indices of Molecular Structural Fragments,
Zh. Org. Khim. (Rus.), 1996, 32, 5, 656-666. [all data]
Bush, Murphy, et al., 1985
Bush, B.; Murphy, M.J.; Connor, S.; Snow, J.; Barnard, E.,
Improvements in Glass Capillary Gas Chromatographic Polychlorobiphenyl Analysis,
J. Chromatogr. Sci., 1985, 23, 11, 509-515, https://doi.org/10.1093/chromsci/23.11.509
. [all data]