4-Bromophenyl sulfone
- Formula: C12H8Br2O2S
- Molecular weight: 376.064
- IUPAC Standard InChIKey: QBNABJXQGRVIRA-UHFFFAOYSA-N
- CAS Registry Number: 2050-48-8
- Chemical structure:
View 3d structure (requires JavaScript / HTML 5) - Other names: Benzene, 1,1'-sulfonylbis(4-bromo-; Bis(p-bromophenyl) sulfone; Sulfone, bis(p-bromophenyl); 4,4'-Dibromodiphenyl sulfone

Gas phase ion energetics data

Data compiled by: Sharon G. Lias, Rhoda D. Levin, and Sherif A. Kafafi
Ionization energy determinations
IE (eV) | Method | Reference |
---|---|---|
8.84 ± 0.05 | PI | Evlasheva, Puchkova, et al., 1975 |

References

Evlasheva, Puchkova, et al., 1975
Evlasheva, T.I.; Puchkova, V.V.; Potapov, V.K.; Gur'yanova, E.N.,
Ionisation potentials and electron-donating properties of sulphones,
Russ. J. Phys. Chem., 1975, 49, 453. [all data]