2-Propanone,1,1,1-trichloro-3-dizao
- Formula: C3HCl3N2O
- Molecular weight: 187.412
- IUPAC Standard InChIKey: ZDZWSRDKBMPXHR-UHFFFAOYSA-N
- CAS Registry Number: 20485-55-6
- Chemical structure:
View 3d structure (requires JavaScript / HTML 5) - Permanent link for this species. Use this link for bookmarking this species for future reference.

Gas phase ion energetics data

Data compiled by: Henry M. Rosenstock, Keith Draxl, Bruce W. Steiner, and John T. Herron
Ionization energy determinations
IE (eV) | Method | Reference |
---|---|---|
9.95 ± 0.06 | EI | Foffani, Pignataro, et al., 1963 |
Appearance energy determinations
Ion | AE (eV) | Other Products | Method | Reference | Comment |
---|---|---|---|---|---|
CCl3+ | 11.0 | ? | EI | Foffani, Pignataro, et al., 1963 | |
C2HN2O+ | 10.12 ± 0.08 | CCl3 | EI | Foffani, Pignataro, et al., 1963 |

References

Foffani, Pignataro, et al., 1963
Foffani, A.; Pignataro, S.; Cantone, B.; Grasso, F.,
Mass spectra of diazocompounds. I. Diazocarbonyl compounds,
Nuovo Cimento, 1963, 29, 918. [all data]