2-Propanone,1-chloro-3-dizao
- Formula: C3H3ClN2O
- Molecular weight: 118.522
- IUPAC Standard InChIKey: QQRZDPCAMOLWBA-UHFFFAOYSA-N
- CAS Registry Number: 20485-53-4
- Chemical structure:
View 3d structure (requires JavaScript / HTML 5) - Permanent link for this species. Use this link for bookmarking this species for future reference.

Gas phase ion energetics data

Data compiled by: Henry M. Rosenstock, Keith Draxl, Bruce W. Steiner, and John T. Herron
Ionization energy determinations
IE (eV) | Method | Reference |
---|---|---|
9.9 ± 0.1 | EI | Foffani, Pignataro, et al., 1963 |
Appearance energy determinations
Ion | AE (eV) | Other Products | Method | Reference | Comment |
---|---|---|---|---|---|
CH2Cl+ | 12.2 ± 0.1 | ? | EI | Foffani, Pignataro, et al., 1963 | |
C2HN2O+ | 10.95 ± 0.15 | CH2Cl | EI | Foffani, Pignataro, et al., 1963 | |
C2H2OCl+ | 11.66 ± 0.04 | ? | EI | Foffani, Pignataro, et al., 1963 |

References

Foffani, Pignataro, et al., 1963
Foffani, A.; Pignataro, S.; Cantone, B.; Grasso, F.,
Mass spectra of diazocompounds. I. Diazocarbonyl compounds,
Nuovo Cimento, 1963, 29, 918. [all data]