1,3-Dithietane,2,2,4,4-tetrachloro-
- Formula: C2Cl4S2
- Molecular weight: 229.963
- IUPAC Standard InChIKey: QIULAHZFLGCCFQ-UHFFFAOYSA-N
- CAS Registry Number: 20464-23-7
- Chemical structure:
View 3d structure (requires JavaScript / HTML 5) - Permanent link for this species. Use this link for bookmarking this species for future reference.

Gas phase ion energetics data

Data compiled by: Sharon G. Lias, Rhoda D. Levin, and Sherif A. Kafafi
Ionization energy determinations
IE (eV) | Method | Reference | Comment |
---|---|---|---|
9.69 | PE | Bock, Wagner, et al., 1972 | Vertical value |

References

Bock, Wagner, et al., 1972
Bock, H.; Wagner, G.; Kroner, J.,
Photoelektronenspektren und molekuleigenschaften, XIV. Die delokalisation des schwefel-elektronenpaar in CH3S-substituierten aromaten,
Chem. Ber., 1972, 105, 3850. [all data]