Iodide

Ion clustering data

Data compiled as indicated in comments:
B - John E. Bartmess
M - Michael M. Meot-Ner (Mautner) and Sharon G. Lias

Clustering reactions

Iodide = BrI2-

By formula: I- = BrI2-

Quantity Value Units Method Reference Comment
Δr141.8 ± 0.96kJ/molPDisCrider, Harrison, et al., 2011gas phase; B
Δr149.4kJ/molN/ACheck, Faust, et al., 2001gas phase; FeF2-(q); ; ΔS(EA)=4.5; B
Quantity Value Units Method Reference Comment
Δr107.9kJ/molN/ACheck, Faust, et al., 2001gas phase; FeF2-(q); ; ΔS(EA)=4.5; B

Iodide = CH3ClI-

By formula: I- = CH3ClI-

Quantity Value Units Method Reference Comment
Δr33.8 ± 0.96kJ/molN/AVan Duzor, Wei, et al., 2010gas phase; B

Iodide = C6H5INO2-

By formula: I- = C6H5INO2-

Quantity Value Units Method Reference Comment
Δr46.4 ± 8.4kJ/molN/APiani, Becucci, et al., 2008gas phase; Stated electron affinity is the Vertical Detachment Energy; B

Iodide = HIS-

By formula: I- = HIS-

Quantity Value Units Method Reference Comment
Δr76.15kJ/molN/ACheck, Faust, et al., 2001gas phase; H-; ; ΔS(acid)=20.9; ΔS(EA)=6.4; B
Quantity Value Units Method Reference Comment
Δr56.07kJ/molN/ACheck, Faust, et al., 2001gas phase; H-; ; ΔS(acid)=20.9; ΔS(EA)=6.4; B

Iodide = IRb-

By formula: I- = IRb-

Quantity Value Units Method Reference Comment
Δr95.0 ± 4.2kJ/molTherMiller, Leopold, et al., 1986gas phase; Extrapolated by polarizability and radius from experimental data.; B

Iodide + Argon = (Iodide • Argon)

By formula: I- + Ar = (I- • Ar)

Quantity Value Units Method Reference Comment
Δr2.5kJ/molTherZhao, Yourshaw, et al., 1994gas phase; B

Iodide + Trichloromethane = (Iodide • Trichloromethane)

By formula: I- + CHCl3 = (I- • CHCl3)

Quantity Value Units Method Reference Comment
Δr59.0 ± 4.2kJ/molTDAsCaldwell, Masucci, et al., 1989gas phase; B,M

Iodide + Fluoroform = (Iodide • Fluoroform)

By formula: I- + CHF3 = (I- • CHF3)

Quantity Value Units Method Reference Comment
Δr54.0 ± 4.2kJ/molTDAsCaldwell, Masucci, et al., 1989gas phase; B,M

Iodide + Hydrogen cyanide = (Iodide • Hydrogen cyanide)

By formula: I- + CHN = (I- • CHN)

Quantity Value Units Method Reference Comment
Δr70.3 ± 4.2kJ/molTDAsMeot-ner, Cybulski, et al., 1988gas phase; B,M
Quantity Value Units Method Reference Comment
Δr88.7J/mol*KPHPMSMeot-ner, Cybulski, et al., 1988gas phase; M
Quantity Value Units Method Reference Comment
Δr43.5 ± 6.7kJ/molTDAsMeot-ner, Cybulski, et al., 1988gas phase; B

(Iodide • Hydrogen cyanide) + Hydrogen cyanide = (Iodide • 2Hydrogen cyanide)

By formula: (I- • CHN) + CHN = (I- • 2CHN)

Quantity Value Units Method Reference Comment
Δr55.2 ± 4.2kJ/molTDAsMeot-ner, Cybulski, et al., 1988gas phase; B,M
Quantity Value Units Method Reference Comment
Δr83.7J/mol*KPHPMSMeot-ner, Cybulski, et al., 1988gas phase; M
Quantity Value Units Method Reference Comment
Δr30.1kJ/molTDAsMeot-ner, Cybulski, et al., 1988gas phase; B

(Iodide • 2Hydrogen cyanide) + Hydrogen cyanide = (Iodide • 3Hydrogen cyanide)

By formula: (I- • 2CHN) + CHN = (I- • 3CHN)

Quantity Value Units Method Reference Comment
Δr46.9 ± 4.2kJ/molTDAsMeot-ner, Cybulski, et al., 1988gas phase; B,M
Quantity Value Units Method Reference Comment
Δr87.9J/mol*KPHPMSMeot-ner, Cybulski, et al., 1988gas phase; M
Quantity Value Units Method Reference Comment
Δr20.5kJ/molTDAsMeot-ner, Cybulski, et al., 1988gas phase; B

(Iodide • 3Hydrogen cyanide) + Hydrogen cyanide = (Iodide • 4Hydrogen cyanide)

By formula: (I- • 3CHN) + CHN = (I- • 4CHN)

Quantity Value Units Method Reference Comment
Δr38. ± 4.2kJ/molTDAsMeot-ner, Cybulski, et al., 1988gas phase; B,M
Quantity Value Units Method Reference Comment
Δr84.9J/mol*KPHPMSMeot-ner, Cybulski, et al., 1988gas phase; M
Quantity Value Units Method Reference Comment
Δr13.4kJ/molTDAsMeot-ner, Cybulski, et al., 1988gas phase; B

(Iodide • 4Hydrogen cyanide) + Hydrogen cyanide = (Iodide • 5Hydrogen cyanide)

By formula: (I- • 4CHN) + CHN = (I- • 5CHN)

Quantity Value Units Method Reference Comment
Δr36. ± 4.2kJ/molTDAsMeot-ner, Cybulski, et al., 1988gas phase; B,M
Quantity Value Units Method Reference Comment
Δr95.8J/mol*KPHPMSMeot-ner, Cybulski, et al., 1988gas phase; M
Quantity Value Units Method Reference Comment
Δr7.53kJ/molTDAsMeot-ner, Cybulski, et al., 1988gas phase; B

(Iodide • 5Hydrogen cyanide) + Hydrogen cyanide = (Iodide • 6Hydrogen cyanide)

By formula: (I- • 5CHN) + CHN = (I- • 6CHN)

Quantity Value Units Method Reference Comment
Δr31. ± 4.2kJ/molTDAsMeot-ner, Cybulski, et al., 1988gas phase; B,M
Quantity Value Units Method Reference Comment
Δr83.3J/mol*KPHPMSMeot-ner, Cybulski, et al., 1988gas phase; M
Quantity Value Units Method Reference Comment
Δr6.28kJ/molTDAsMeot-ner, Cybulski, et al., 1988gas phase; B

(Iodide • 6Hydrogen cyanide) + Hydrogen cyanide = (Iodide • 7Hydrogen cyanide)

By formula: (I- • 6CHN) + CHN = (I- • 7CHN)

Quantity Value Units Method Reference Comment
Δr31. ± 4.2kJ/molTDAsMeot-ner, Cybulski, et al., 1988gas phase; B,M
Quantity Value Units Method Reference Comment
Δr83.3J/mol*KPHPMSMeot-ner, Cybulski, et al., 1988gas phase; M
Quantity Value Units Method Reference Comment
Δr6.28kJ/molTDAsMeot-ner, Cybulski, et al., 1988gas phase; B

(Iodide • 7Hydrogen cyanide) + Hydrogen cyanide = (Iodide • 8Hydrogen cyanide)

By formula: (I- • 7CHN) + CHN = (I- • 8CHN)

Quantity Value Units Method Reference Comment
Δr28. ± 4.2kJ/molTDAsMeot-ner, Cybulski, et al., 1988gas phase; B,M
Quantity Value Units Method Reference Comment
Δr88.7J/mol*KPHPMSMeot-ner, Cybulski, et al., 1988gas phase; M
Quantity Value Units Method Reference Comment
Δr2.1kJ/molTDAsMeot-ner, Cybulski, et al., 1988gas phase; B

Iodide + Formic acid = (Iodide • Formic acid)

By formula: I- + CH2O2 = (I- • CH2O2)

Quantity Value Units Method Reference Comment
Δr79.1 ± 4.2kJ/molTDAsCaldwell and Kebarle, 1984gas phase; B,M
Δr54.0 ± 8.8kJ/molCIDTWalker and Sunderlin, 1999gas phase; Authors suggest real value somewhere between this and Caldwell and Kebarle, 1984; B
Quantity Value Units Method Reference Comment
Δr86.6J/mol*KPHPMSCaldwell and Kebarle, 1984gas phase; M
Quantity Value Units Method Reference Comment
Δr53.1 ± 4.2kJ/molTDAsCaldwell and Kebarle, 1984gas phase; B

Iodide + Methane, bromo- = (Iodide • Methane, bromo-)

By formula: I- + CH3Br = (I- • CH3Br)

Quantity Value Units Method Reference Comment
Δr34.7 ± 0.84kJ/molN/AVan Duzor, Wei, et al., 2010gas phase; B
Δr34.7 ± 2.1kJ/molPDisCyr, Bishea, et al., 1992gas phase; B

Iodide + Methane, iodo- = (Iodide • Methane, iodo-)

By formula: I- + CH3I = (I- • CH3I)

Quantity Value Units Method Reference Comment
Δr35.7 ± 0.84kJ/molN/AVan Duzor, Wei, et al., 2010gas phase; B
Δr32.6 ± 0.84kJ/molTDAsHiraoka, Fujita, et al., 1905gas phase; B
Δr35.1 ± 2.1kJ/molN/AArnold, Neumark, et al., 1995gas phase; ZEKE data, shift relative to bare I-; B
Δr34.7 ± 2.1kJ/molPDisCyr, Bishea, et al., 1992gas phase; B
Δr38. ± 8.4kJ/molTDAsDougherty and Roberts, 1974gas phase; B,M
Quantity Value Units Method Reference Comment
Δr68.6J/mol*KHPMSDougherty and Roberts, 1974gas phase; M
Quantity Value Units Method Reference Comment
Δr11.4 ± 0.84kJ/molTDAsHiraoka, Fujita, et al., 1905gas phase; B
Δr17.2 ± 1.3kJ/molTDAsDougherty and Roberts, 1974gas phase; B

Iodide + Methane, nitro- = (Iodide • Methane, nitro-)

By formula: I- + CH3NO2 = (I- • CH3NO2)

Quantity Value Units Method Reference Comment
Δr51.0 ± 4.2kJ/molTDAsCaldwell, Masucci, et al., 1989gas phase; B,M

Iodide + Methyl Alcohol = (Iodide • Methyl Alcohol)

By formula: I- + CH4O = (I- • CH4O)

Quantity Value Units Method Reference Comment
Δr49.79 ± 0.84kJ/molTDAsBogdanov, Peschke, et al., 1999gas phase; B
Δr47.3 ± 4.2kJ/molTDAsCaldwell and Kebarle, 1984gas phase; B,M
Δr46.9kJ/molPHPMSHiraoka and Yamabe, 1991gas phase; M
Δr46.kJ/molPHPMSCaldwell, Masucci, et al., 1989gas phase; M
Quantity Value Units Method Reference Comment
Δr71.5J/mol*KPHPMSHiraoka and Yamabe, 1991gas phase; M
Δr74.5J/mol*KPHPMSCaldwell and Kebarle, 1984gas phase; M
Quantity Value Units Method Reference Comment
Δr24.1kJ/molTDAsBogdanov, Peschke, et al., 1999gas phase; B
Δr25. ± 4.2kJ/molTDAsCaldwell and Kebarle, 1984gas phase; B
Δr24. ± 8.4kJ/molIMRETanabe, Morgon, et al., 1996gas phase; Anchored to H2O..I- of Caldwell and Kebarle, 1984; B

(Iodide • Methyl Alcohol) + Methyl Alcohol = (Iodide • 2Methyl Alcohol)

By formula: (I- • CH4O) + CH4O = (I- • 2CH4O)

Quantity Value Units Method Reference Comment
Δr39.7 ± 0.84kJ/molTDAsBogdanov, Peschke, et al., 1999gas phase; B
Δr46.4 ± 4.2kJ/molTDAsHiraoka and Yamabe, 1991gas phase; B,M
Quantity Value Units Method Reference Comment
Δr94.6J/mol*KPHPMSHiraoka and Yamabe, 1991gas phase; M
Quantity Value Units Method Reference Comment
Δr17.8kJ/molTDAsBogdanov, Peschke, et al., 1999gas phase; B
Δr18. ± 8.4kJ/molTDAsHiraoka and Yamabe, 1991gas phase; B

(Iodide • 2Methyl Alcohol) + Methyl Alcohol = (Iodide • 3Methyl Alcohol)

By formula: (I- • 2CH4O) + CH4O = (I- • 3CH4O)

Quantity Value Units Method Reference Comment
Δr32.2 ± 2.5kJ/molTDAsBogdanov, Peschke, et al., 1999gas phase; B
Δr41. ± 4.2kJ/molTDAsHiraoka and Yamabe, 1991gas phase; B,M
Quantity Value Units Method Reference Comment
Δr93.7J/mol*KPHPMSHiraoka and Yamabe, 1991gas phase; M
Quantity Value Units Method Reference Comment
Δr14.3kJ/molTDAsBogdanov, Peschke, et al., 1999gas phase; B
Δr13. ± 8.4kJ/molTDAsHiraoka and Yamabe, 1991gas phase; B

(Iodide • 3Methyl Alcohol) + Methyl Alcohol = (Iodide • 4Methyl Alcohol)

By formula: (I- • 3CH4O) + CH4O = (I- • 4CH4O)

Quantity Value Units Method Reference Comment
Δr41. ± 4.2kJ/molTDAsHiraoka and Yamabe, 1991gas phase; B,M
Quantity Value Units Method Reference Comment
Δr104.J/mol*KPHPMSHiraoka and Yamabe, 1991gas phase; M
Quantity Value Units Method Reference Comment
Δr9.6 ± 8.4kJ/molTDAsHiraoka and Yamabe, 1991gas phase; B

(Iodide • 4Methyl Alcohol) + Methyl Alcohol = (Iodide • 5Methyl Alcohol)

By formula: (I- • 4CH4O) + CH4O = (I- • 5CH4O)

Quantity Value Units Method Reference Comment
Δr40. ± 4.2kJ/molTDAsHiraoka and Yamabe, 1991gas phase; B,M
Quantity Value Units Method Reference Comment
Δr113.J/mol*KPHPMSHiraoka and Yamabe, 1991gas phase; M
Quantity Value Units Method Reference Comment
Δr6.3 ± 8.4kJ/molTDAsHiraoka and Yamabe, 1991gas phase; B

(Iodide • 5Methyl Alcohol) + Methyl Alcohol = (Iodide • 6Methyl Alcohol)

By formula: (I- • 5CH4O) + CH4O = (I- • 6CH4O)

Quantity Value Units Method Reference Comment
Δr40. ± 4.2kJ/molTDAsHiraoka and Yamabe, 1991gas phase; B,M
Quantity Value Units Method Reference Comment
Δr115.J/mol*KPHPMSHiraoka and Yamabe, 1991gas phase; M
Quantity Value Units Method Reference Comment
Δr5.9 ± 8.4kJ/molTDAsHiraoka and Yamabe, 1991gas phase; B

(Iodide • 6Methyl Alcohol) + Methyl Alcohol = (Iodide • 7Methyl Alcohol)

By formula: (I- • 6CH4O) + CH4O = (I- • 7CH4O)

Quantity Value Units Method Reference Comment
Δr39. ± 4.2kJ/molTDAsHiraoka and Yamabe, 1991gas phase; B,M
Quantity Value Units Method Reference Comment
Δr117.J/mol*KPHPMSHiraoka and Yamabe, 1991gas phase; M
Quantity Value Units Method Reference Comment
Δr4.6 ± 8.4kJ/molTDAsHiraoka and Yamabe, 1991gas phase; B

(Iodide • 7Methyl Alcohol) + Methyl Alcohol = (Iodide • 8Methyl Alcohol)

By formula: (I- • 7CH4O) + CH4O = (I- • 8CH4O)

Quantity Value Units Method Reference Comment
Δr38. ± 4.2kJ/molTDAsHiraoka and Yamabe, 1991gas phase; Entropy estimated.; B,M
Quantity Value Units Method Reference Comment
Δr120.J/mol*KN/AHiraoka and Yamabe, 1991gas phase; Entropy change calculated or estimated; M
Quantity Value Units Method Reference Comment
Δr3. ± 8.4kJ/molTDAsHiraoka and Yamabe, 1991gas phase; Entropy estimated.; B

Iodide + Methane = CH4I-

By formula: I- + CH4 = CH4I-

Quantity Value Units Method Reference Comment
Δr10.9kJ/molN/AHiraoka, Mizuno, et al., 2001gas phase; B
Quantity Value Units Method Reference Comment
Δr-11.6kJ/molTDAsHiraoka, Mizuno, et al., 2001gas phase; B

Iodide + Carbon dioxide = (Iodide • Carbon dioxide)

By formula: I- + CO2 = (I- • CO2)

Quantity Value Units Method Reference Comment
Δr15. ± 7.5kJ/molN/APiani, Becucci, et al., 2008gas phase; Stated electron affinity is the Vertical Detachment Energy; B
Δr17. ± 8.4kJ/molPDisArnold, Bradforth, et al., 1995gas phase; EA given is Vertical Detachment Energy. Affinity: difference between successive EAs in (Y); B
Δr20. ± 8.4kJ/molTDAsHiraoka, Mizuse, et al., 1987gas phase; B,M
Δr13.4kJ/molN/AGomez, Taylor, et al., 2002gas phase; EA=Vertical Detachment Energy. Affinity is stepwise difference in EAs.; B
Δr23.4 ± 0.42kJ/molTDAsKeesee, Lee, et al., 1980gas phase; B,M
Quantity Value Units Method Reference Comment
Δr56.1J/mol*KPHPMSHiraoka, Mizuse, et al., 1987gas phase; M
Δr76.1J/mol*KHPMSKeesee, Lee, et al., 1980gas phase; M
Quantity Value Units Method Reference Comment
Δr3. ± 8.4kJ/molTDAsHiraoka, Mizuse, et al., 1987gas phase; B
Δr3.3 ± 0.42kJ/molTDAsBanic and Iribarne, 1985gas phase; B,M
Δr1.7 ± 0.42kJ/molTDAsKeesee, Lee, et al., 1980gas phase; B

(Iodide • Carbon dioxide) + Carbon dioxide = (Iodide • 2Carbon dioxide)

By formula: (I- • CO2) + CO2 = (I- • 2CO2)

Quantity Value Units Method Reference Comment
Δr15. ± 8.4kJ/molPDisArnold, Bradforth, et al., 1995gas phase; EA given is Vertical Detachment Energy. Affinity: difference between successive EAs in (Y); B
Δr20. ± 4.2kJ/molTDAsHiraoka, Mizuse, et al., 1987gas phase; B,M
Δr10.9kJ/molN/AGomez, Taylor, et al., 2002gas phase; EA=Vertical Detachment Energy. Affinity is stepwise difference in EAs.; B
Quantity Value Units Method Reference Comment
Δr72.4J/mol*KPHPMSHiraoka, Mizuse, et al., 1987gas phase; M
Quantity Value Units Method Reference Comment
Δr3. ± 8.4kJ/molTDAsHiraoka, Mizuse, et al., 1987gas phase; B

(Iodide • 2Carbon dioxide) + Carbon dioxide = (Iodide • 3Carbon dioxide)

By formula: (I- • 2CO2) + CO2 = (I- • 3CO2)

Quantity Value Units Method Reference Comment
Δr9.20kJ/molN/AGomez, Taylor, et al., 2002gas phase; EA=Vertical Detachment Energy. Affinity is stepwise difference in EAs.; B
Δr15. ± 8.4kJ/molPDisArnold, Bradforth, et al., 1995gas phase; EA given is Vertical Detachment Energy. Affinity: difference between successive EAs in (Y); B
Δr19. ± 4.2kJ/molTDAsHiraoka, Mizuse, et al., 1987gas phase; B,M
Quantity Value Units Method Reference Comment
Δr77.0J/mol*KPHPMSHiraoka, Mizuse, et al., 1987gas phase; M
Quantity Value Units Method Reference Comment
Δr-3. ± 8.4kJ/molTDAsHiraoka, Mizuse, et al., 1987gas phase; B

(Iodide • 3Carbon dioxide) + Carbon dioxide = (Iodide • 4Carbon dioxide)

By formula: (I- • 3CO2) + CO2 = (I- • 4CO2)

Quantity Value Units Method Reference Comment
Δr7.53kJ/molN/AGomez, Taylor, et al., 2002gas phase; EA=Vertical Detachment Energy. Affinity is stepwise difference in EAs.; B
Δr15. ± 8.4kJ/molPDisArnold, Bradforth, et al., 1995gas phase; EA given is Vertical Detachment Energy. Affinity: difference between successive EAs in (Y); B
Δr19. ± 4.2kJ/molTDAsHiraoka, Mizuse, et al., 1987gas phase; B
Quantity Value Units Method Reference Comment
Δr-4.2 ± 8.4kJ/molTDAsHiraoka, Mizuse, et al., 1987gas phase; B

(Iodide • 4Carbon dioxide) + Carbon dioxide = (Iodide • 5Carbon dioxide)

By formula: (I- • 4CO2) + CO2 = (I- • 5CO2)

Quantity Value Units Method Reference Comment
Δr7.11kJ/molN/AGomez, Taylor, et al., 2002gas phase; EA=Vertical Detachment Energy. Affinity is stepwise difference in EAs.; B
Δr13. ± 8.4kJ/molPDisArnold, Bradforth, et al., 1995gas phase; EA given is Vertical Detachment Energy. Affinity: difference between successive EAs in (Y); B
Δr18. ± 4.2kJ/molTDAsHiraoka, Mizuse, et al., 1987gas phase; B,M
Quantity Value Units Method Reference Comment
Δr79.5J/mol*KPHPMSHiraoka, Mizuse, et al., 1987gas phase; M
Quantity Value Units Method Reference Comment
Δr-5.9 ± 8.4kJ/molTDAsHiraoka, Mizuse, et al., 1987gas phase; B

(Iodide • 5Carbon dioxide) + Carbon dioxide = (Iodide • 6Carbon dioxide)

By formula: (I- • 5CO2) + CO2 = (I- • 6CO2)

Quantity Value Units Method Reference Comment
Δr13. ± 8.4kJ/molPDisArnold, Bradforth, et al., 1995gas phase; EA given is Vertical Detachment Energy. Affinity: difference between successive EAs in (Y); B
Δr7.53kJ/molN/AGomez, Taylor, et al., 2002gas phase; EA=Vertical Detachment Energy. Affinity is stepwise difference in EAs.; B
Δr18.kJ/molPHPMSHiraoka, Mizuse, et al., 1987gas phase; Entropy change calculated or estimated; M
Quantity Value Units Method Reference Comment
Δr79.J/mol*KN/AHiraoka, Mizuse, et al., 1987gas phase; Entropy change calculated or estimated; M

(Iodide • 6Carbon dioxide) + Carbon dioxide = (Iodide • 7Carbon dioxide)

By formula: (I- • 6CO2) + CO2 = (I- • 7CO2)

Quantity Value Units Method Reference Comment
Δr14. ± 8.4kJ/molPDisArnold, Bradforth, et al., 1995gas phase; EA given is Vertical Detachment Energy. Affinity: difference between successive EAs in (Y); B
Δr7.95kJ/molN/AGomez, Taylor, et al., 2002gas phase; EA=Vertical Detachment Energy. Affinity is stepwise difference in EAs.; B

(Iodide • 7Carbon dioxide) + Carbon dioxide = (Iodide • 8Carbon dioxide)

By formula: (I- • 7CO2) + CO2 = (I- • 8CO2)

Quantity Value Units Method Reference Comment
Δr13. ± 8.4kJ/molPDisArnold, Bradforth, et al., 1995gas phase; EA given is Vertical Detachment Energy. Affinity: difference between successive EAs in (Y); B
Δr7.95kJ/molN/AGomez, Taylor, et al., 2002gas phase; EA=Vertical Detachment Energy. Affinity is stepwise difference in EAs.; B

(Iodide • 8Carbon dioxide) + Carbon dioxide = (Iodide • 9Carbon dioxide)

By formula: (I- • 8CO2) + CO2 = (I- • 9CO2)

Quantity Value Units Method Reference Comment
Δr12. ± 8.4kJ/molPDisArnold, Bradforth, et al., 1995gas phase; EA given is Vertical Detachment Energy. Affinity: difference between successive EAs in (Y); B

(Iodide • 9Carbon dioxide) + Carbon dioxide = (Iodide • 10Carbon dioxide)

By formula: (I- • 9CO2) + CO2 = (I- • 10CO2)

Quantity Value Units Method Reference Comment
Δr4. ± 8.4kJ/molPDisArnold, Bradforth, et al., 1995gas phase; EA given is Vertical Detachment Energy. Affinity: difference between successive EAs in (Y); B

(Iodide • 10Carbon dioxide) + Carbon dioxide = (Iodide • 11Carbon dioxide)

By formula: (I- • 10CO2) + CO2 = (I- • 11CO2)

Quantity Value Units Method Reference Comment
Δr4.2 ± 8.4kJ/molPDisArnold, Bradforth, et al., 1995gas phase; EA given is Vertical Detachment Energy. Affinity: difference between successive EAs in (Y); B

(Iodide • 11Carbon dioxide) + Carbon dioxide = (Iodide • 12Carbon dioxide)

By formula: (I- • 11CO2) + CO2 = (I- • 12CO2)

Quantity Value Units Method Reference Comment
Δr6.7 ± 8.4kJ/molPDisArnold, Bradforth, et al., 1995gas phase; EA given is Vertical Detachment Energy. Affinity: difference between successive EAs in (Y); B

(Iodide • 12Carbon dioxide) + Carbon dioxide = (Iodide • 13Carbon dioxide)

By formula: (I- • 12CO2) + CO2 = (I- • 13CO2)

Quantity Value Units Method Reference Comment
Δr4.6 ± 8.4kJ/molPDisArnold, Bradforth, et al., 1995gas phase; EA given is Vertical Detachment Energy. Affinity: difference between successive EAs in (Y); B

Iodide + Carbon disulfide = (Iodide • Carbon disulfide)

By formula: I- + CS2 = (I- • CS2)

Quantity Value Units Method Reference Comment
Δr31.0 ± 0.84kJ/molTDAsHiraoka, Fujimaki, et al., 1993gas phase; B,M
Quantity Value Units Method Reference Comment
Δr69.9J/mol*KPHPMSHiraoka, Fujimaki, et al., 1993gas phase; M
Quantity Value Units Method Reference Comment
Δr10. ± 4.2kJ/molTDAsHiraoka, Fujimaki, et al., 1993gas phase; B

(Iodide • Carbon disulfide) + Carbon disulfide = (Iodide • 2Carbon disulfide)

By formula: (I- • CS2) + CS2 = (I- • 2CS2)

Quantity Value Units Method Reference Comment
Δr28.5 ± 0.84kJ/molTDAsHiraoka, Fujimaki, et al., 1993gas phase; B,M
Quantity Value Units Method Reference Comment
Δr90.8J/mol*KPHPMSHiraoka, Fujimaki, et al., 1993gas phase; M
Quantity Value Units Method Reference Comment
Δr0.8 ± 4.2kJ/molTDAsHiraoka, Fujimaki, et al., 1993gas phase; B

Iodide + Ethanol, 2,2,2-trifluoro- = (Iodide • Ethanol, 2,2,2-trifluoro-)

By formula: I- + C2H3F3O = (I- • C2H3F3O)

Quantity Value Units Method Reference Comment
Δr84.1 ± 4.2kJ/molTDAsCaldwell, Masucci, et al., 1989gas phase; B,M

Iodide + Acetonitrile = (Iodide • Acetonitrile)

By formula: I- + C2H3N = (I- • C2H3N)

Quantity Value Units Method Reference Comment
Δr49.8 ± 8.4kJ/molTDAsYamdagni and Kebarle, 1972gas phase; B,M
Δr46.4 ± 1.7kJ/molN/AMarkovich, Perera, et al., 1996gas phase; B
Δr46.4 ± 4.6kJ/molLPESDessent, Bailey, et al., 1995gas phase; B
Δr46.02 ± 0.84kJ/molTDAsHiraoka, Mizuse, et al., 1988gas phase; B,M
Δr50.kJ/molPHPMSCaldwell, Masucci, et al., 1989gas phase; M
Quantity Value Units Method Reference Comment
Δr57.7J/mol*KPHPMSHiraoka, Mizuse, et al., 1988gas phase; M
Δr76.1J/mol*KPHPMSYamdagni and Kebarle, 1972gas phase; M
Quantity Value Units Method Reference Comment
Δr27. ± 8.4kJ/molTDAsYamdagni and Kebarle, 1972gas phase; B
Δr28. ± 8.4kJ/molIMRETanabe, Morgon, et al., 1996gas phase; Anchored to H2O..I- of Caldwell and Kebarle, 1984; B
Δr28.9 ± 2.1kJ/molTDAsHiraoka, Mizuse, et al., 1988gas phase; B

(Iodide • Acetonitrile) + Acetonitrile = (Iodide • 2Acetonitrile)

By formula: (I- • C2H3N) + C2H3N = (I- • 2C2H3N)

Quantity Value Units Method Reference Comment
Δr43.51 ± 0.84kJ/molTDAsHiraoka, Mizuse, et al., 1988gas phase; B,M
Δr46.4 ± 2.9kJ/molN/AMarkovich, Perera, et al., 1996gas phase; B
Δr46.4 ± 1.7kJ/molN/ADessent, Bailey, et al., 1995gas phase; Vertical Detachment Energy: 2.25±0.08 eV.; B
Δr43.93kJ/molTDAsYamdagni and Kebarle, 1972gas phase; B,M
Quantity Value Units Method Reference Comment
Δr77.0J/mol*KPHPMSHiraoka, Mizuse, et al., 1988gas phase; M
Δr87.0J/mol*KPHPMSYamdagni and Kebarle, 1972gas phase; M
Quantity Value Units Method Reference Comment
Δr20.5 ± 3.3kJ/molTDAsHiraoka, Mizuse, et al., 1988gas phase; B
Δr18.0kJ/molTDAsYamdagni and Kebarle, 1972gas phase; B

(Iodide • 2Acetonitrile) + Acetonitrile = (Iodide • 3Acetonitrile)

By formula: (I- • 2C2H3N) + C2H3N = (I- • 3C2H3N)

Quantity Value Units Method Reference Comment
Δr38.5 ± 0.84kJ/molTDAsHiraoka, Mizuse, et al., 1988gas phase; B,M
Δr40.6 ± 2.9kJ/molN/AMarkovich, Perera, et al., 1996gas phase; B
Δr38.9kJ/molTDAsYamdagni and Kebarle, 1972gas phase; B,M
Quantity Value Units Method Reference Comment
Δr83.3J/mol*KPHPMSHiraoka, Mizuse, et al., 1988gas phase; M
Δr92.5J/mol*KPHPMSYamdagni and Kebarle, 1972gas phase; M
Quantity Value Units Method Reference Comment
Δr13.4 ± 3.3kJ/molTDAsHiraoka, Mizuse, et al., 1988gas phase; B
Δr11.3kJ/molTDAsYamdagni and Kebarle, 1972gas phase; B

(Iodide • 3Acetonitrile) + Acetonitrile = (Iodide • 4Acetonitrile)

By formula: (I- • 3C2H3N) + C2H3N = (I- • 4C2H3N)

Quantity Value Units Method Reference Comment
Δr32.6 ± 0.42kJ/molTDAsHiraoka, Mizuse, et al., 1988gas phase; B,M
Δr31.0 ± 3.3kJ/molN/AMarkovich, Perera, et al., 1996gas phase; B
Quantity Value Units Method Reference Comment
Δr80.8J/mol*KPHPMSHiraoka, Mizuse, et al., 1988gas phase; M
Quantity Value Units Method Reference Comment
Δr8.4 ± 1.7kJ/molTDAsHiraoka, Mizuse, et al., 1988gas phase; B

(Iodide • 4Acetonitrile) + Acetonitrile = (Iodide • 5Acetonitrile)

By formula: (I- • 4C2H3N) + C2H3N = (I- • 5C2H3N)

Quantity Value Units Method Reference Comment
Δr29.7 ± 1.3kJ/molTDAsHiraoka, Mizuse, et al., 1988gas phase; B,M
Δr44.4 ± 3.8kJ/molN/AMarkovich, Perera, et al., 1996gas phase; B
Quantity Value Units Method Reference Comment
Δr79.1J/mol*KPHPMSHiraoka, Mizuse, et al., 1988gas phase; M
Quantity Value Units Method Reference Comment
Δr5.9 ± 5.9kJ/molTDAsHiraoka, Mizuse, et al., 1988gas phase; B

(Iodide • 5Acetonitrile) + Acetonitrile = (Iodide • 6Acetonitrile)

By formula: (I- • 5C2H3N) + C2H3N = (I- • 6C2H3N)

Quantity Value Units Method Reference Comment
Δr-10. ± 4.2kJ/molN/AMarkovich, Perera, et al., 1996gas phase; B

(Iodide • 6Acetonitrile) + Acetonitrile = (Iodide • 7Acetonitrile)

By formula: (I- • 6C2H3N) + C2H3N = (I- • 7C2H3N)

Quantity Value Units Method Reference Comment
Δr15. ± 4.6kJ/molN/AMarkovich, Perera, et al., 1996gas phase; B

(Iodide • 7Acetonitrile) + Acetonitrile = (Iodide • 8Acetonitrile)

By formula: (I- • 7C2H3N) + C2H3N = (I- • 8C2H3N)

Quantity Value Units Method Reference Comment
Δr13. ± 5.0kJ/molN/AMarkovich, Perera, et al., 1996gas phase; B

(Iodide • 8Acetonitrile) + Acetonitrile = (Iodide • 9Acetonitrile)

By formula: (I- • 8C2H3N) + C2H3N = (I- • 9C2H3N)

Quantity Value Units Method Reference Comment
Δr10. ± 5.9kJ/molN/AMarkovich, Perera, et al., 1996gas phase; B

(Iodide • 9Acetonitrile) + Acetonitrile = (Iodide • 10Acetonitrile)

By formula: (I- • 9C2H3N) + C2H3N = (I- • 10C2H3N)

Quantity Value Units Method Reference Comment
Δr10. ± 6.3kJ/molN/AMarkovich, Perera, et al., 1996gas phase; B

(Iodide • 10Acetonitrile) + Acetonitrile = (Iodide • 11Acetonitrile)

By formula: (I- • 10C2H3N) + C2H3N = (I- • 11C2H3N)

Quantity Value Units Method Reference Comment
Δr8.8 ± 6.7kJ/molN/AMarkovich, Perera, et al., 1996gas phase; B

(Iodide • 11Acetonitrile) + Acetonitrile = (Iodide • 12Acetonitrile)

By formula: (I- • 11C2H3N) + C2H3N = (I- • 12C2H3N)

Quantity Value Units Method Reference Comment
Δr8.8 ± 7.1kJ/molN/AMarkovich, Perera, et al., 1996gas phase; B

(Iodide • 13Acetonitrile) + Acetonitrile = (Iodide • 14Acetonitrile)

By formula: (I- • 13C2H3N) + C2H3N = (I- • 14C2H3N)

Quantity Value Units Method Reference Comment
Δr-4. ± 7.9kJ/molN/AMarkovich, Perera, et al., 1996gas phase; B

Iodide + 2,2,2-Trifluoroethylamine = (Iodide • 2,2,2-Trifluoroethylamine)

By formula: I- + C2H4F3N = (I- • C2H4F3N)

Quantity Value Units Method Reference Comment
Δr59.0 ± 4.2kJ/molTDAsCaldwell, Masucci, et al., 1989gas phase; B,M

Iodide + Acetic acid = (Iodide • Acetic acid)

By formula: I- + C2H4O2 = (I- • C2H4O2)

Quantity Value Units Method Reference Comment
Δr70.7 ± 4.2kJ/molTDAsCaldwell and Kebarle, 1984gas phase; B,M
Quantity Value Units Method Reference Comment
Δr89.1J/mol*KPHPMSCaldwell and Kebarle, 1984gas phase; M
Quantity Value Units Method Reference Comment
Δr43.9 ± 4.2kJ/molTDAsCaldwell and Kebarle, 1984gas phase; B

Iodide + Dimethyl Sulfoxide = (Iodide • Dimethyl Sulfoxide)

By formula: I- + C2H6OS = (I- • C2H6OS)

Quantity Value Units Method Reference Comment
Δr65.69kJ/molTDAsMagnera, Caldwell, et al., 1984gas phase; B,M
Δr67.kJ/molPHPMSCaldwell, Masucci, et al., 1989gas phase; M
Quantity Value Units Method Reference Comment
Δr90.8J/mol*KPHPMSMagnera, Caldwell, et al., 1984gas phase; M
Quantity Value Units Method Reference Comment
Δr38.5kJ/molTDAsMagnera, Caldwell, et al., 1984gas phase; B

(Iodide • Dimethyl Sulfoxide) + Dimethyl Sulfoxide = (Iodide • 2Dimethyl Sulfoxide)

By formula: (I- • C2H6OS) + C2H6OS = (I- • 2C2H6OS)

Quantity Value Units Method Reference Comment
Δr53.6kJ/molPHPMSMagnera, Caldwell, et al., 1984gas phase; M
Quantity Value Units Method Reference Comment
Δr92.0J/mol*KPHPMSMagnera, Caldwell, et al., 1984gas phase; M

(Iodide • 2Dimethyl Sulfoxide) + Dimethyl Sulfoxide = (Iodide • 3Dimethyl Sulfoxide)

By formula: (I- • 2C2H6OS) + C2H6OS = (I- • 3C2H6OS)

Quantity Value Units Method Reference Comment
Δr48.5kJ/molPHPMSMagnera, Caldwell, et al., 1984gas phase; M
Quantity Value Units Method Reference Comment
Δr105.J/mol*KPHPMSMagnera, Caldwell, et al., 1984gas phase; M

Iodide + Ethanol = (Iodide • Ethanol)

By formula: I- + C2H6O = (I- • C2H6O)

Quantity Value Units Method Reference Comment
Δr54.39 ± 0.84kJ/molTDAsBogdanov, Peschke, et al., 1999gas phase; B
Δr50.6 ± 4.2kJ/molTDAsCaldwell and Kebarle, 1984gas phase; B,M
Quantity Value Units Method Reference Comment
Δr79.1J/mol*KPHPMSCaldwell and Kebarle, 1984gas phase; M
Quantity Value Units Method Reference Comment
Δr25.6kJ/molTDAsBogdanov, Peschke, et al., 1999gas phase; B
Δr27. ± 4.2kJ/molTDAsCaldwell and Kebarle, 1984gas phase; B
Δr25. ± 8.4kJ/molIMRETanabe, Morgon, et al., 1996gas phase; Anchored to H2O..I- of Caldwell and Kebarle, 1984; B

Iodide + 2Ethanol = C4H12IO2-

By formula: I- + 2C2H6O = C4H12IO2-

Quantity Value Units Method Reference Comment
Δr43.93 ± 0.84kJ/molTDAsBogdanov, Peschke, et al., 1999gas phase; B
Quantity Value Units Method Reference Comment
Δr18.5kJ/molTDAsBogdanov, Peschke, et al., 1999gas phase; B

Iodide + 3Ethanol = C6H18IO3-

By formula: I- + 3C2H6O = C6H18IO3-

Quantity Value Units Method Reference Comment
Δr35.1 ± 2.1kJ/molTDAsBogdanov, Peschke, et al., 1999gas phase; B
Quantity Value Units Method Reference Comment
Δr14.7kJ/molTDAsBogdanov, Peschke, et al., 1999gas phase; B

Iodide + Propene, hexafluoro- = C3F6I-

By formula: I- + C3F6 = C3F6I-

Quantity Value Units Method Reference Comment
Δr36.0 ± 1.3kJ/molTDAsHiraoka, Takao, et al., 2002gas phase; B
Quantity Value Units Method Reference Comment
Δr6.0 ± 1.3kJ/molTDAsHiraoka, Takao, et al., 2002gas phase; B

Iodide + 2-Propanol, 1,1,1,3,3,3-hexafluoro- = (Iodide • 2-Propanol, 1,1,1,3,3,3-hexafluoro-)

By formula: I- + C3H2F6O = (I- • C3H2F6O)

Quantity Value Units Method Reference Comment
Δr100. ± 4.2kJ/molTDAsCaldwell, Masucci, et al., 1989gas phase; B,M

Iodide + Propanedinitrile = (Iodide • Propanedinitrile)

By formula: I- + C3H2N2 = (I- • C3H2N2)

Quantity Value Units Method Reference Comment
Δr79.1 ± 4.2kJ/molTDAsCaldwell, Masucci, et al., 1989gas phase; B,M

Iodide + Acetone = (Iodide • Acetone)

By formula: I- + C3H6O = (I- • C3H6O)

Quantity Value Units Method Reference Comment
Δr50.2 ± 4.2kJ/molTDAsCaldwell, Masucci, et al., 1989gas phase; B,M

Iodide + Propanoic acid = (Iodide • Propanoic acid)

By formula: I- + C3H6O2 = (I- • C3H6O2)

Quantity Value Units Method Reference Comment
Δr69.5 ± 4.2kJ/molTDAsCaldwell and Kebarle, 1984gas phase; B
Quantity Value Units Method Reference Comment
Δr43.9 ± 4.2kJ/molTDAsCaldwell and Kebarle, 1984gas phase; B

Iodide + Ethyl formate = (Iodide • Ethyl formate)

By formula: I- + C3H6O2 = (I- • C3H6O2)

Quantity Value Units Method Reference Comment
Δr69.5kJ/molPHPMSCaldwell and Kebarle, 1984gas phase; M
Quantity Value Units Method Reference Comment
Δr85.4J/mol*KPHPMSCaldwell and Kebarle, 1984gas phase; M

Iodide + Isopropyl Alcohol = (Iodide • Isopropyl Alcohol)

By formula: I- + C3H8O = (I- • C3H8O)

Quantity Value Units Method Reference Comment
Δr54.81 ± 0.84kJ/molTDAsBogdanov, Peschke, et al., 1999gas phase; B
Δr51.0 ± 4.2kJ/molTDAsCaldwell and Kebarle, 1984gas phase; B,M
Quantity Value Units Method Reference Comment
Δr79.9J/mol*KPHPMSCaldwell and Kebarle, 1984gas phase; M
Quantity Value Units Method Reference Comment
Δr26.5kJ/molTDAsBogdanov, Peschke, et al., 1999gas phase; B
Δr27. ± 4.2kJ/molTDAsCaldwell and Kebarle, 1984gas phase; B

Iodide + 2Isopropyl Alcohol = C6H16IO2-

By formula: I- + 2C3H8O = C6H16IO2-

Quantity Value Units Method Reference Comment
Δr46.0 ± 1.3kJ/molTDAsBogdanov, Peschke, et al., 1999gas phase; B
Quantity Value Units Method Reference Comment
Δr19.5kJ/molTDAsBogdanov, Peschke, et al., 1999gas phase; B

Iodide + 3Isopropyl Alcohol = C9H24IO3-

By formula: I- + 3C3H8O = C9H24IO3-

Quantity Value Units Method Reference Comment
Δr39.7 ± 2.9kJ/molTDAsBogdanov, Peschke, et al., 1999gas phase; B
Quantity Value Units Method Reference Comment
Δr14.8kJ/molTDAsBogdanov, Peschke, et al., 1999gas phase; B

Iodide + 1,1,1,3,3,3-Hexafluoro-2-(trifluoromethyl)-2-propanol = (Iodide • 1,1,1,3,3,3-Hexafluoro-2-(trifluoromethyl)-2-propanol)

By formula: I- + C4HF9O = (I- • C4HF9O)

Quantity Value Units Method Reference Comment
Δr97.1 ± 4.2kJ/molTDAsCaldwell, Masucci, et al., 1989gas phase; B,M

Iodide + Propanoic acid, 2-methyl- = (Iodide • Propanoic acid, 2-methyl-)

By formula: I- + C4H8O2 = (I- • C4H8O2)

Quantity Value Units Method Reference Comment
Δr69.9 ± 4.2kJ/molTDAsCaldwell and Kebarle, 1984gas phase; B,M
Quantity Value Units Method Reference Comment
Δr85.8J/mol*KPHPMSCaldwell and Kebarle, 1984gas phase; M
Quantity Value Units Method Reference Comment
Δr44.4 ± 4.2kJ/molTDAsCaldwell and Kebarle, 1984gas phase; B

Iodide + 2-Propanol, 2-methyl- = (Iodide • 2-Propanol, 2-methyl-)

By formula: I- + C4H10O = (I- • C4H10O)

Quantity Value Units Method Reference Comment
Δr54.8 ± 1.3kJ/molTDAsBogdanov, Peschke, et al., 1999gas phase; B
Δr50.6 ± 4.2kJ/molTDAsCaldwell and Kebarle, 1984gas phase; B,M
Quantity Value Units Method Reference Comment
Δr78.2J/mol*KPHPMSCaldwell and Kebarle, 1984gas phase; M
Quantity Value Units Method Reference Comment
Δr25.7kJ/molTDAsBogdanov, Peschke, et al., 1999gas phase; B
Δr27. ± 4.2kJ/molTDAsCaldwell and Kebarle, 1984gas phase; B

Iodide + 22-Propanol, 2-methyl- = C8H20IO2-

By formula: I- + 2C4H10O = C8H20IO2-

Quantity Value Units Method Reference Comment
Δr47.3 ± 1.7kJ/molTDAsBogdanov, Peschke, et al., 1999gas phase; B
Quantity Value Units Method Reference Comment
Δr18.1kJ/molTDAsBogdanov, Peschke, et al., 1999gas phase; B

Iodide + Cyclopentene, octafluoro- = C5F8I-

By formula: I- + C5F8 = C5F8I-

Quantity Value Units Method Reference Comment
Δr41.84 ± 0.84kJ/molTDAsHiraoka, Fujita, et al., 1905gas phase; B
Quantity Value Units Method Reference Comment
Δr16.9 ± 0.84kJ/molTDAsHiraoka, Fujita, et al., 1905gas phase; B

Iodide + Acetylacetone = (Iodide • Acetylacetone)

By formula: I- + C5H8O2 = (I- • C5H8O2)

Quantity Value Units Method Reference Comment
Δr63.2 ± 4.2kJ/molTDAsCaldwell, Masucci, et al., 1989gas phase; B,M

Iodide + Propanoic acid, 2,2-dimethyl- = (Iodide • Propanoic acid, 2,2-dimethyl-)

By formula: I- + C5H10O2 = (I- • C5H10O2)

Quantity Value Units Method Reference Comment
Δr64.4 ± 4.2kJ/molTDAsCaldwell and Kebarle, 1984gas phase; B,M
Quantity Value Units Method Reference Comment
Δr90.8J/mol*KPHPMSCaldwell and Kebarle, 1984gas phase; M
Quantity Value Units Method Reference Comment
Δr37. ± 4.2kJ/molTDAsCaldwell and Kebarle, 1984gas phase; B

Iodide + Benzene, hexafluoro- = (Iodide • Benzene, hexafluoro-)

By formula: I- + C6F6 = (I- • C6F6)

Quantity Value Units Method Reference Comment
Δr46.0 ± 4.2kJ/molTDAsHiraoka, Mizuse, et al., 1987, 2gas phase; B,M
Quantity Value Units Method Reference Comment
Δr72.4J/mol*KPHPMSHiraoka, Mizuse, et al., 1987, 2gas phase; M
Quantity Value Units Method Reference Comment
Δr24. ± 6.7kJ/molTDAsHiraoka, Mizuse, et al., 1987, 2gas phase; B

(Iodide • Benzene, hexafluoro-) + Benzene, hexafluoro- = (Iodide • 2Benzene, hexafluoro-)

By formula: (I- • C6F6) + C6F6 = (I- • 2C6F6)

Quantity Value Units Method Reference Comment
Δr43.5kJ/molPHPMSHiraoka, Mizuse, et al., 1987, 2gas phase; M
Quantity Value Units Method Reference Comment
Δr90.4J/mol*KPHPMSHiraoka, Mizuse, et al., 1987, 2gas phase; M

Iodide + Phenol, 4-chloro- = (Iodide • Phenol, 4-chloro-)

By formula: I- + C6H5ClO = (I- • C6H5ClO)

Quantity Value Units Method Reference Comment
Δr85.8 ± 7.5kJ/molIMREPaul and Kebarle, 1990gas phase; ΔGaff at 423 K; B,M
Quantity Value Units Method Reference Comment
Δr88.J/mol*KN/APaul and Kebarle, 1990gas phase; Entropy change calculated or estimated; M
Quantity Value Units Method Reference Comment
Δr48.5 ± 4.2kJ/molIMREPaul and Kebarle, 1990gas phase; ΔGaff at 423 K; B

Free energy of reaction

ΔrG° (kJ/mol) T (K) Method Reference Comment
48.5423.PHPMSPaul and Kebarle, 1990gas phase; Entropy change calculated or estimated; M

Iodide + Phenol, 3-chloro- = (Iodide • Phenol, 3-chloro-)

By formula: I- + C6H5ClO = (I- • C6H5ClO)

Quantity Value Units Method Reference Comment
Δr88.3 ± 7.5kJ/molIMREPaul and Kebarle, 1990gas phase; ΔGaff at 423 K; B,M
Quantity Value Units Method Reference Comment
Δr88.J/mol*KN/APaul and Kebarle, 1990gas phase; Entropy change calculated or estimated; M
Quantity Value Units Method Reference Comment
Δr51.0 ± 4.2kJ/molIMREPaul and Kebarle, 1990gas phase; ΔGaff at 423 K; B

Free energy of reaction

ΔrG° (kJ/mol) T (K) Method Reference Comment
51.0423.PHPMSPaul and Kebarle, 1990gas phase; Entropy change calculated or estimated; M

Iodide + Phenol, 4-fluoro- = (Iodide • Phenol, 4-fluoro-)

By formula: I- + C6H5FO = (I- • C6H5FO)

Quantity Value Units Method Reference Comment
Δr82.0 ± 7.5kJ/molIMREPaul and Kebarle, 1990gas phase; ΔGaff at 423 K; B,M
Quantity Value Units Method Reference Comment
Δr88.J/mol*KN/APaul and Kebarle, 1990gas phase; Entropy change calculated or estimated; M
Quantity Value Units Method Reference Comment
Δr44.8 ± 4.2kJ/molIMREPaul and Kebarle, 1990gas phase; ΔGaff at 423 K; B

Free energy of reaction

ΔrG° (kJ/mol) T (K) Method Reference Comment
43.9423.PHPMSPaul and Kebarle, 1990gas phase; Entropy change calculated or estimated; M

Iodide + Phenol, 3-fluoro- = (Iodide • Phenol, 3-fluoro-)

By formula: I- + C6H5FO = (I- • C6H5FO)

Quantity Value Units Method Reference Comment
Δr81.2 ± 7.5kJ/molIMREPaul and Kebarle, 1990gas phase; ΔGaff at 423 K; B,M
Quantity Value Units Method Reference Comment
Δr88.J/mol*KN/APaul and Kebarle, 1990gas phase; Entropy change calculated or estimated; M
Quantity Value Units Method Reference Comment
Δr43.9 ± 4.2kJ/molIMREPaul and Kebarle, 1990gas phase; ΔGaff at 423 K; B

Free energy of reaction

ΔrG° (kJ/mol) T (K) Method Reference Comment
44.8423.PHPMSPaul and Kebarle, 1990gas phase; Entropy change calculated or estimated; M

Iodide + Phenol, 3-nitro- = (Iodide • Phenol, 3-nitro-)

By formula: I- + C6H5NO3 = (I- • C6H5NO3)

Quantity Value Units Method Reference Comment
Δr97.1 ± 7.5kJ/molIMREPaul and Kebarle, 1990gas phase; ΔGaff at 423 K; B,M
Quantity Value Units Method Reference Comment
Δr88.J/mol*KN/APaul and Kebarle, 1990gas phase; Entropy change calculated or estimated; M
Quantity Value Units Method Reference Comment
Δr59.8 ± 4.2kJ/molIMREPaul and Kebarle, 1990gas phase; ΔGaff at 423 K; B

Free energy of reaction

ΔrG° (kJ/mol) T (K) Method Reference Comment
59.8423.PHPMSPaul and Kebarle, 1990gas phase; Entropy change calculated or estimated; M

Iodide + Phenol = (Iodide • Phenol)

By formula: I- + C6H6O = (I- • C6H6O)

Quantity Value Units Method Reference Comment
Δr72.4 ± 7.5kJ/molIMREPaul and Kebarle, 1990gas phase; ΔGaff at 423 K; B,M
Quantity Value Units Method Reference Comment
Δr88.J/mol*KN/APaul and Kebarle, 1990gas phase; Entropy change calculated or estimated; M
Quantity Value Units Method Reference Comment
Δr35. ± 4.2kJ/molIMREPaul and Kebarle, 1990gas phase; ΔGaff at 423 K; B

Free energy of reaction

ΔrG° (kJ/mol) T (K) Method Reference Comment
35.423.PHPMSPaul and Kebarle, 1990gas phase; Entropy change calculated or estimated; M

Iodide + Benzene = (Iodide • Benzene)

By formula: I- + C6H6 = (I- • C6H6)

Quantity Value Units Method Reference Comment
Δr26. ± 8.4kJ/molTDAsHiraoka, Mizuse, et al., 1988, 2gas phase; B,M
Δr38. ± 4.2kJ/molTDAsCaldwell, Masucci, et al., 1989gas phase; B,M
Quantity Value Units Method Reference Comment
Δr59.4J/mol*KPHPMSHiraoka, Mizuse, et al., 1988, 2gas phase; M
Quantity Value Units Method Reference Comment
Δr8. ± 11.kJ/molTDAsHiraoka, Mizuse, et al., 1988, 2gas phase; B

Iodide + Aniline = (Iodide • Aniline)

By formula: I- + C6H7N = (I- • C6H7N)

Quantity Value Units Method Reference Comment
Δr54.0 ± 4.2kJ/molTDAsCaldwell, Masucci, et al., 1989gas phase; B,M

Iodide + Benzonitrile, 4-hydroxy- = (Iodide • Benzonitrile, 4-hydroxy-)

By formula: I- + C7H5NO = (I- • C7H5NO)

Quantity Value Units Method Reference Comment
Δr99.6 ± 7.5kJ/molIMREPaul and Kebarle, 1990gas phase; ΔGaff at 423 K; B,M
Quantity Value Units Method Reference Comment
Δr88.J/mol*KN/APaul and Kebarle, 1990gas phase; Entropy change calculated or estimated; M
Quantity Value Units Method Reference Comment
Δr62.3 ± 4.2kJ/molIMREPaul and Kebarle, 1990gas phase; ΔGaff at 423 K; B

Free energy of reaction

ΔrG° (kJ/mol) T (K) Method Reference Comment
62.3423.PHPMSPaul and Kebarle, 1990gas phase; Entropy change calculated or estimated; M

Iodide + Benzonitrile, 3-hydroxy- = (Iodide • Benzonitrile, 3-hydroxy-)

By formula: I- + C7H5NO = (I- • C7H5NO)

Quantity Value Units Method Reference Comment
Δr96.2 ± 7.5kJ/molIMREPaul and Kebarle, 1990gas phase; ΔGaff at 423 K; B,M
Quantity Value Units Method Reference Comment
Δr88.J/mol*KN/APaul and Kebarle, 1990gas phase; Entropy change calculated or estimated; M
Quantity Value Units Method Reference Comment
Δr59.0 ± 4.2kJ/molIMREPaul and Kebarle, 1990gas phase; ΔGaff at 423 K; B

Free energy of reaction

ΔrG° (kJ/mol) T (K) Method Reference Comment
59.0423.PHPMSPaul and Kebarle, 1990gas phase; Entropy change calculated or estimated; M

Iodide + p-Cresol = (Iodide • p-Cresol)

By formula: I- + C7H8O = (I- • C7H8O)

Quantity Value Units Method Reference Comment
Δr68.6 ± 7.5kJ/molIMREPaul and Kebarle, 1990gas phase; ΔGaff at 423 K; B,M
Quantity Value Units Method Reference Comment
Δr88.J/mol*KN/APaul and Kebarle, 1990gas phase; Entropy change calculated or estimated; M
Quantity Value Units Method Reference Comment
Δr31. ± 4.2kJ/molIMREPaul and Kebarle, 1990gas phase; ΔGaff at 423 K; B

Free energy of reaction

ΔrG° (kJ/mol) T (K) Method Reference Comment
31.423.PHPMSPaul and Kebarle, 1990gas phase; Entropy change calculated or estimated; M

Iodide + Toluene = (Iodide • Toluene)

By formula: I- + C7H8 = (I- • C7H8)

Quantity Value Units Method Reference Comment
Δr46.0 ± 4.2kJ/molTDAsCaldwell, Masucci, et al., 1989gas phase; B,M

Iodide + CeI3 = (Iodide • CeI3)

By formula: I- + CeI3 = (I- • CeI3)

Quantity Value Units Method Reference Comment
Δr280. ± 33.kJ/molTDEqChantry, 1976gas phase; B,M
Quantity Value Units Method Reference Comment
Δr120.J/mol*KMSChantry, 1976gas phase; heated collision chamber; M
Quantity Value Units Method Reference Comment
Δr250. ± 42.kJ/molTDEqChantry, 1976gas phase; B

Iodide + Cesium iodide = (Iodide • Cesium iodide)

By formula: I- + CsI = (I- • CsI)

Quantity Value Units Method Reference Comment
Δr141.00 ± 0.21kJ/molN/AWang, Wang, et al., 2010gas phase; B
Δr151. ± 5.4kJ/molN/AGusarov, Gorokhov, et al., 1979gas phase; value altered from reference due to conversion from electron convention to ion convention; B

Iodide + CsI2 = (Iodide • CsI2)

By formula: I- + CsI2 = (I- • CsI2)

Quantity Value Units Method Reference Comment
Δr115. ± 13.kJ/molN/AGusarov, Gorokhov, et al., 1979gas phase; value altered from reference due to conversion from electron convention to ion convention; B

Iodide + DyI3 = (Iodide • DyI3)

By formula: I- + DyI3 = (I- • DyI3)

Quantity Value Units Method Reference Comment
Δr279. ± 8.4kJ/molTDAsLelik, Korobov, et al., 1984gas phase; anion heat reworked from reference due to better dHf(DyI3); value altered from reference due to conversion from electron convention to ion convention; B

Iodide + Hydrogen bromide = (Iodide • Hydrogen bromide)

By formula: I- + HBr = (I- • HBr)

Bond type: Hydrogen bond (negative ion to hydride)

Quantity Value Units Method Reference Comment
Δr67.4 ± 8.4kJ/molTDEqCaldwell and Kebarle, 1985gas phase; B,M
Quantity Value Units Method Reference Comment
Δr82.0J/mol*KPHPMSCaldwell and Kebarle, 1985gas phase; switching reaction(I-)SO2; M
Quantity Value Units Method Reference Comment
Δr43. ± 11.kJ/molTDEqCaldwell and Kebarle, 1985gas phase; B

Free energy of reaction

ΔrG° (kJ/mol) T (K) Method Reference Comment
42.7300.PHPMSCaldwell and Kebarle, 1985gas phase; switching reaction(I-)SO2; M

Iodide + Hydrogen chloride = (Iodide • Hydrogen chloride)

By formula: I- + HCl = (I- • HCl)

Bond type: Hydrogen bond (negative ion to hydride)

Quantity Value Units Method Reference Comment
Δr61.9 ± 8.4kJ/molTDAsCaldwell and Kebarle, 1985gas phase; B,M
Δr59.4kJ/molHPMSKeesee, Lee, et al., 1980gas phase; M
Quantity Value Units Method Reference Comment
Δr83.7J/mol*KPHPMSCaldwell and Kebarle, 1985gas phase; M
Δr95.0J/mol*KHPMSKeesee, Lee, et al., 1980gas phase; M
Quantity Value Units Method Reference Comment
Δr37. ± 11.kJ/molTDAsCaldwell and Kebarle, 1985gas phase; B

Iodide + hydrogen fluoride = (Iodide • hydrogen fluoride)

By formula: I- + HF = (I- • HF)

Bond type: Hydrogen bond (negative ion to hydride)

Quantity Value Units Method Reference Comment
Δr62.8 ± 8.4kJ/molEstLarson and McMahon, 1984gas phase; Extrapolated from other bihalide data; B
Δr63.kJ/molPHPMSCaldwell, Masucci, et al., 1989gas phase; M

Iodide + Hydrogen iodide = (Iodide • Hydrogen iodide)

By formula: I- + HI = (I- • HI)

Bond type: Hydrogen bond (negative ion to hydride)

Quantity Value Units Method Reference Comment
Δr71.1 ± 8.4kJ/molTDEqCaldwell and Kebarle, 1985gas phase; B,M
Quantity Value Units Method Reference Comment
Δr102.J/mol*KPHPMSCaldwell and Kebarle, 1985gas phase; switching reaction(I-)SO2; M
Quantity Value Units Method Reference Comment
Δr41. ± 11.kJ/molTDEqCaldwell and Kebarle, 1985gas phase; B

Free energy of reaction

ΔrG° (kJ/mol) T (K) Method Reference Comment
41.300.PHPMSCaldwell and Kebarle, 1985gas phase; switching reaction(I-)SO2; M

Iodide + Water = (Iodide • Water)

By formula: I- + H2O = (I- • H2O)

Bond type: Hydrogen bond (negative ion to hydride)

Quantity Value Units Method Reference Comment
Δr43. ± 3.kJ/molAVGN/AAverage of 6 values; Individual data points
Quantity Value Units Method Reference Comment
Δr64.0J/mol*KPHPMSHiraoka, Mizuse, et al., 1988gas phase; M
Δr80.8J/mol*KHPMSKeesee and Castleman, 1980gas phase; M
Δr68.2J/mol*KHPMSArshadi, Yamdagni, et al., 1970gas phase; M
Quantity Value Units Method Reference Comment
Δr23. ± 1.kJ/molAVGN/AAverage of 6 values; Individual data points

Free energy of reaction

ΔrG° (kJ/mol) T (K) Method Reference Comment
22.300.HPMSBanic and Iribarne, 1985gas phase; electric fields; M

(Iodide • Water) + Water = (Iodide • 2Water)

By formula: (I- • H2O) + H2O = (I- • 2H2O)

Bond type: Hydrogen bond (negative ion to hydride)

Quantity Value Units Method Reference Comment
Δr41.4 ± 0.84kJ/molTDAsKeesee and Castleman, 1980gas phase; B,M
Δr39.7kJ/molN/AMarkovich, Pollack, et al., 1994gas phase; For photodissociation plus electron loss. Affinity is difference from lower solvated ion.; B
Δr39.7 ± 0.84kJ/molTDAsHiraoka, Mizuse, et al., 1988gas phase; B,M
Δr41. ± 4.2kJ/molTDAsPayzant, Yamdagni, et al., 1971gas phase; B
Δr41. ± 4.2kJ/molTDAsArshadi, Yamdagni, et al., 1970gas phase; B,M
Quantity Value Units Method Reference Comment
Δr73.6J/mol*KPHPMSHiraoka, Mizuse, et al., 1988gas phase; M
Δr84.9J/mol*KHPMSKeesee and Castleman, 1980gas phase; M
Δr79.5J/mol*KHPMSArshadi, Yamdagni, et al., 1970gas phase; M
Quantity Value Units Method Reference Comment
Δr17. ± 2.kJ/molAVGN/AAverage of 6 values; Individual data points

Free energy of reaction

ΔrG° (kJ/mol) T (K) Method Reference Comment
17.300.HPMSBanic and Iribarne, 1985gas phase; electric fields; M

(Iodide • 2Water) + Water = (Iodide • 3Water)

By formula: (I- • 2H2O) + H2O = (I- • 3H2O)

Bond type: Hydrogen bond (negative ion to hydride)

Quantity Value Units Method Reference Comment
Δr38.9 ± 1.3kJ/molTDAsKeesee and Castleman, 1980gas phase; B,M
Δr36. ± 9.6kJ/molN/AMarkovich, Pollack, et al., 1994gas phase; For photodissociation plus electron loss. Affinity is difference from lower solvated ion.; B
Δr38.5 ± 0.84kJ/molTDAsHiraoka, Mizuse, et al., 1988gas phase; B,M
Δr39. ± 4.2kJ/molTDAsPayzant, Yamdagni, et al., 1971gas phase; B
Δr39. ± 4.2kJ/molTDAsArshadi, Yamdagni, et al., 1970gas phase; B,M
Quantity Value Units Method Reference Comment
Δr85.4J/mol*KPHPMSHiraoka, Mizuse, et al., 1988gas phase; M
Δr87.9J/mol*KHPMSKeesee and Castleman, 1980gas phase; M
Δr89.1J/mol*KHPMSArshadi, Yamdagni, et al., 1970gas phase; M
Quantity Value Units Method Reference Comment
Δr12.6kJ/molTDAsKeesee and Castleman, 1980gas phase; B
Δr13.0 ± 3.3kJ/molTDAsHiraoka, Mizuse, et al., 1988gas phase; B
Δr14. ± 8.4kJ/molTDAsKebarle, Arshadi, et al., 1968gas phase; B,M

(Iodide • 3Water) + Water = (Iodide • 4Water)

By formula: (I- • 3H2O) + H2O = (I- • 4H2O)

Bond type: Hydrogen bond (negative ion to hydride)

Quantity Value Units Method Reference Comment
Δr38.5 ± 1.7kJ/molTDAsHiraoka, Mizuse, et al., 1988gas phase; B,M
Δr29. ± 9.6kJ/molN/AMarkovich, Pollack, et al., 1994gas phase; For photodissociation plus electron loss. Affinity is difference from lower solvated ion.; B
Quantity Value Units Method Reference Comment
Δr98.7J/mol*KPHPMSHiraoka, Mizuse, et al., 1988gas phase; M
Quantity Value Units Method Reference Comment
Δr8.8 ± 6.7kJ/molTDAsHiraoka, Mizuse, et al., 1988gas phase; B
Δr9.2 ± 8.4kJ/molTDAsKebarle, Arshadi, et al., 1968gas phase; B,M

(Iodide • 4Water) + Water = (Iodide • 5Water)

By formula: (I- • 4H2O) + H2O = (I- • 5H2O)

Bond type: Hydrogen bond (negative ion to hydride)

Quantity Value Units Method Reference Comment
Δr37.7kJ/molTDAsHiraoka, Mizuse, et al., 1988gas phase; Entropy estimated; B,M
Δr17.6kJ/molN/AMarkovich, Pollack, et al., 1994gas phase; For photodissociation plus electron loss. Affinity is difference from lower solvated ion.; B
Quantity Value Units Method Reference Comment
Δr100.J/mol*KN/AHiraoka, Mizuse, et al., 1988gas phase; Entropy change calculated or estimated; M
Quantity Value Units Method Reference Comment
Δr6.28kJ/molTDAsHiraoka, Mizuse, et al., 1988gas phase; Entropy estimated; B

(Iodide • 5Water) + Water = (Iodide • 6Water)

By formula: (I- • 5H2O) + H2O = (I- • 6H2O)

Quantity Value Units Method Reference Comment
Δr32.6kJ/molN/AMarkovich, Pollack, et al., 1994gas phase; For photodissociation plus electron loss. Affinity is difference from lower solvated ion.; B

(Iodide • 6Water) + Water = (Iodide • 7Water)

By formula: (I- • 6H2O) + H2O = (I- • 7H2O)

Quantity Value Units Method Reference Comment
Δr7.53kJ/molN/AMarkovich, Pollack, et al., 1994gas phase; For photodissociation plus electron loss. Affinity is difference from lower solvated ion.; B

(Iodide • 7Water) + Water = (Iodide • 8Water)

By formula: (I- • 7H2O) + H2O = (I- • 8H2O)

Quantity Value Units Method Reference Comment
Δr2.9kJ/molN/AMarkovich, Pollack, et al., 1994gas phase; For photodissociation plus electron loss. Affinity is difference from lower solvated ion.; B

(Iodide • 8Water) + Water = (Iodide • 9Water)

By formula: (I- • 8H2O) + H2O = (I- • 9H2O)

Quantity Value Units Method Reference Comment
Δr16.3kJ/molN/AMarkovich, Pollack, et al., 1994gas phase; For photodissociation plus electron loss. Affinity is difference from lower solvated ion.; B

(Iodide • 9Water) + Water = (Iodide • 10Water)

By formula: (I- • 9H2O) + H2O = (I- • 10H2O)

Quantity Value Units Method Reference Comment
Δr5.86kJ/molN/AMarkovich, Pollack, et al., 1994gas phase; For photodissociation plus electron loss. Affinity is difference from lower solvated ion.; B

(Iodide • 10Water) + Water = (Iodide • 11Water)

By formula: (I- • 10H2O) + H2O = (I- • 11H2O)

Quantity Value Units Method Reference Comment
Δr2.9kJ/molN/AMarkovich, Pollack, et al., 1994gas phase; For photodissociation plus electron loss. Affinity is difference from lower solvated ion.; B

(Iodide • 11Water) + Water = (Iodide • 12Water)

By formula: (I- • 11H2O) + H2O = (I- • 12H2O)

Quantity Value Units Method Reference Comment
Δr5.86kJ/molN/AMarkovich, Pollack, et al., 1994gas phase; For photodissociation plus electron loss. Affinity is difference from lower solvated ion.; B

(Iodide • 12Water) + Water = (Iodide • 13Water)

By formula: (I- • 12H2O) + H2O = (I- • 13H2O)

Quantity Value Units Method Reference Comment
Δr7.53kJ/molN/AMarkovich, Pollack, et al., 1994gas phase; For photodissociation plus electron loss. Affinity is difference from lower solvated ion.; B

(Iodide • 13Water) + Water = (Iodide • 14Water)

By formula: (I- • 13H2O) + H2O = (I- • 14H2O)

Quantity Value Units Method Reference Comment
Δr0.84kJ/molN/AMarkovich, Pollack, et al., 1994gas phase; For photodissociation plus electron loss. Affinity is difference from lower solvated ion.; B

(Iodide • 14Water) + Water = (Iodide • 15Water)

By formula: (I- • 14H2O) + H2O = (I- • 15H2O)

Quantity Value Units Method Reference Comment
Δr5.02kJ/molN/AMarkovich, Pollack, et al., 1994gas phase; For photodissociation plus electron loss. Affinity is difference from lower solvated ion.; B

(Iodide • 15Water) + Water = (Iodide • 16Water)

By formula: (I- • 15H2O) + H2O = (I- • 16H2O)

Quantity Value Units Method Reference Comment
Δr5.02kJ/molN/AMarkovich, Pollack, et al., 1994gas phase; For photodissociation plus electron loss. Affinity is difference from lower solvated ion.; B

(Iodide • Water) + Sulfur dioxide = (Iodide • Sulfur dioxide • Water)

By formula: (I- • H2O) + O2S = (I- • O2S • H2O)

Quantity Value Units Method Reference Comment
Δr37.7 ± 0.42kJ/molTDAsBanic and Iribarne, 1985gas phase; B

Free energy of reaction

ΔrG° (kJ/mol) T (K) Method Reference Comment
30.300.HPMSBanic and Iribarne, 1985gas phase; electric fields; M

Iodide + Hydrogen sulfide = (Iodide • Hydrogen sulfide)

By formula: I- + H2S = (I- • H2S)

Bond type: Hydrogen bond (negative ion to hydride)

Quantity Value Units Method Reference Comment
Δr37. ± 4.2kJ/molTDAsCaldwell, Masucci, et al., 1989gas phase; B,M

Iodide + Ammonia = (Iodide • Ammonia)

By formula: I- + H3N = (I- • H3N)

Bond type: Hydrogen bond (negative ion to hydride)

Quantity Value Units Method Reference Comment
Δr31.0 ± 1.3kJ/molTDAsEvans, Keesee, et al., 1987gas phase; B,M
Δr31. ± 4.2kJ/molTDAsCaldwell, Masucci, et al., 1989gas phase; B,M
Quantity Value Units Method Reference Comment
Δr87.4J/mol*KHPMSEvans, Keesee, et al., 1987gas phase; M
Quantity Value Units Method Reference Comment
Δr5.0 ± 2.5kJ/molTDAsEvans, Keesee, et al., 1987gas phase; B

Iodide + HoI3 = (Iodide • HoI3)

By formula: I- + HoI3 = (I- • HoI3)

Quantity Value Units Method Reference Comment
Δr288.7kJ/molTDAsBencze, Kaposi, et al., 1988gas phase; Data at 0 K. See also Pramann and Rademann, 1999; value altered from reference due to conversion from electron convention to ion convention; B

Iodide + potassium iodide = (Iodide • potassium iodide)

By formula: I- + IK = (I- • IK)

Quantity Value Units Method Reference Comment
Δr163. ± 8.8kJ/molN/ABurdukovskaya, Kudin, et al., 1984gas phase; value altered from reference due to conversion from electron convention to ion convention; B

Iodide + Iodine = (Iodide • Iodine)

By formula: I- + I2 = (I- • I2)

Quantity Value Units Method Reference Comment
Δr100.kJ/molN/ADowns and Adams, 1973gas phase; from ΔrH(f); M

Iodide + Iodine = I3-

By formula: I- + I2 = I3-

Quantity Value Units Method Reference Comment
Δr136. ± 10.kJ/molN/ATaylor, Asmis, et al., 1999gas phase; B
Δr126. ± 5.9kJ/molCIDTDo, Klein, et al., 1997gas phase; B
Δr356.1kJ/molTherFinch, Gates, et al., 1977gas phase; This value is far more bound than expected from other studies; B
Δr136.4kJ/molN/ACheck, Faust, et al., 2001gas phase; FeF3-(t); ; ΔS(EA)=2.8; B
Quantity Value Units Method Reference Comment
Δr94.14kJ/molN/ACheck, Faust, et al., 2001gas phase; FeF3-(t); ; ΔS(EA)=2.8; B

Iodide + phosphorus triiodide = I4P-

By formula: I- + I3P = I4P-

Quantity Value Units Method Reference Comment
Δr54.0 ± 7.9kJ/molCIDTHeil, Check, et al., 2002gas phase; B

Iodide + Krypton = (Iodide • Krypton)

By formula: I- + Kr = (I- • Kr)

Quantity Value Units Method Reference Comment
Δr4.18kJ/molTherZhao, Yourshaw, et al., 1994gas phase; B

Iodide + Nitrous oxide = (Iodide • Nitrous oxide)

By formula: I- + N2O = (I- • N2O)

Quantity Value Units Method Reference Comment
Δr11. ± 8.4kJ/molPDisArnold, Bradforth, et al., 1995gas phase; EA given is Vertical Detachment Energy. Affinity: difference between successive EAs in (Y); B
Δr16. ± 1.kJ/molPHPMSHiraoka, Aruga, et al., 1993gas phase; M
Quantity Value Units Method Reference Comment
Δr59.0J/mol*KPHPMSHiraoka, Aruga, et al., 1993gas phase; M

(Iodide • Nitrous oxide) + Nitrous oxide = (Iodide • 2Nitrous oxide)

By formula: (I- • N2O) + N2O = (I- • 2N2O)

Quantity Value Units Method Reference Comment
Δr12. ± 8.4kJ/molPDisArnold, Bradforth, et al., 1995gas phase; EA given is Vertical Detachment Energy. Affinity: difference between successive EAs in (Y); B
Δr14. ± 1.kJ/molPHPMSHiraoka, Aruga, et al., 1993gas phase; M
Quantity Value Units Method Reference Comment
Δr59.4J/mol*KPHPMSHiraoka, Aruga, et al., 1993gas phase; M

(Iodide • 2Nitrous oxide) + Nitrous oxide = (Iodide • 3Nitrous oxide)

By formula: (I- • 2N2O) + N2O = (I- • 3N2O)

Quantity Value Units Method Reference Comment
Δr11. ± 8.4kJ/molPDisArnold, Bradforth, et al., 1995gas phase; EA given is Vertical Detachment Energy. Affinity: difference between successive EAs in (Y); B
Δr13.kJ/molPHPMSHiraoka, Aruga, et al., 1993gas phase; Entropy change calculated or estimated; M
Quantity Value Units Method Reference Comment
Δr63.J/mol*KN/AHiraoka, Aruga, et al., 1993gas phase; Entropy change calculated or estimated; M

(Iodide • 3Nitrous oxide) + Nitrous oxide = (Iodide • 4Nitrous oxide)

By formula: (I- • 3N2O) + N2O = (I- • 4N2O)

Quantity Value Units Method Reference Comment
Δr12. ± 8.4kJ/molPDisArnold, Bradforth, et al., 1995gas phase; EA given is Vertical Detachment Energy. Affinity: difference between successive EAs in (Y); B

(Iodide • 4Nitrous oxide) + Nitrous oxide = (Iodide • 5Nitrous oxide)

By formula: (I- • 4N2O) + N2O = (I- • 5N2O)

Quantity Value Units Method Reference Comment
Δr11. ± 8.4kJ/molPDisArnold, Bradforth, et al., 1995gas phase; EA given is Vertical Detachment Energy. Affinity: difference between successive EAs in (Y); B

(Iodide • 5Nitrous oxide) + Nitrous oxide = (Iodide • 6Nitrous oxide)

By formula: (I- • 5N2O) + N2O = (I- • 6N2O)

Quantity Value Units Method Reference Comment
Δr9.6 ± 8.4kJ/molPDisArnold, Bradforth, et al., 1995gas phase; EA given is Vertical Detachment Energy. Affinity: difference between successive EAs in (Y); B

(Iodide • 6Nitrous oxide) + Nitrous oxide = (Iodide • 7Nitrous oxide)

By formula: (I- • 6N2O) + N2O = (I- • 7N2O)

Quantity Value Units Method Reference Comment
Δr9.2 ± 8.4kJ/molPDisArnold, Bradforth, et al., 1995gas phase; EA given is Vertical Detachment Energy. Affinity: difference between successive EAs in (Y); B

(Iodide • 7Nitrous oxide) + Nitrous oxide = (Iodide • 8Nitrous oxide)

By formula: (I- • 7N2O) + N2O = (I- • 8N2O)

Quantity Value Units Method Reference Comment
Δr8.8 ± 8.4kJ/molPDisArnold, Bradforth, et al., 1995gas phase; EA given is Vertical Detachment Energy. Affinity: difference between successive EAs in (Y); B

(Iodide • 8Nitrous oxide) + Nitrous oxide = (Iodide • 9Nitrous oxide)

By formula: (I- • 8N2O) + N2O = (I- • 9N2O)

Quantity Value Units Method Reference Comment
Δr10. ± 8.4kJ/molPDisArnold, Bradforth, et al., 1995gas phase; EA given is Vertical Detachment Energy. Affinity: difference between successive EAs in (Y); B

(Iodide • 9Nitrous oxide) + Nitrous oxide = (Iodide • 10Nitrous oxide)

By formula: (I- • 9N2O) + N2O = (I- • 10N2O)

Quantity Value Units Method Reference Comment
Δr7.5 ± 8.4kJ/molPDisArnold, Bradforth, et al., 1995gas phase; EA given is Vertical Detachment Energy. Affinity: difference between successive EAs in (Y); B

(Iodide • 10Nitrous oxide) + Nitrous oxide = (Iodide • 11Nitrous oxide)

By formula: (I- • 10N2O) + N2O = (I- • 11N2O)

Quantity Value Units Method Reference Comment
Δr4.2 ± 8.4kJ/molPDisArnold, Bradforth, et al., 1995gas phase; EA given is Vertical Detachment Energy. Affinity: difference between successive EAs in (Y); B

(Iodide • 11Nitrous oxide) + Nitrous oxide = (Iodide • 12Nitrous oxide)

By formula: (I- • 11N2O) + N2O = (I- • 12N2O)

Quantity Value Units Method Reference Comment
Δr5.4 ± 8.4kJ/molPDisArnold, Bradforth, et al., 1995gas phase; EA given is Vertical Detachment Energy. Affinity: difference between successive EAs in (Y); B

(Iodide • 4294967295sodium) + sodium = Iodide

By formula: (I- • 4294967295Na) + Na = I-

Quantity Value Units Method Reference Comment
Δr82.0 ± 9.6kJ/molN/AMiller, Leopold, et al., 1986gas phase; B

Iodide + Sulfur dioxide = (Iodide • Sulfur dioxide)

By formula: I- + O2S = (I- • O2S)

Quantity Value Units Method Reference Comment
Δr59.8 ± 8.4kJ/molTDAsCaldwell and Kebarle, 1985gas phase; B,M
Δr53.97 ± 0.42kJ/molTDAsKeesee, Lee, et al., 1980gas phase; B,M
Quantity Value Units Method Reference Comment
Δr73.6J/mol*KPHPMSCaldwell and Kebarle, 1985gas phase; M
Δr84.5J/mol*KHPMSKeesee, Lee, et al., 1980gas phase; M
Quantity Value Units Method Reference Comment
Δr38. ± 11.kJ/molTDAsCaldwell and Kebarle, 1985gas phase; B
Δr7.11 ± 0.42kJ/molTDAsBanic and Iribarne, 1985gas phase; B
Δr28.5 ± 0.84kJ/molTDAsKeesee, Lee, et al., 1980gas phase; B

Free energy of reaction

ΔrG° (kJ/mol) T (K) Method Reference Comment
38.301.HPMSBanic and Iribarne, 1985gas phase; electric fields; M

(Iodide • Sulfur dioxide) + Water = (Iodide • Water • Sulfur dioxide)

By formula: (I- • O2S) + H2O = (I- • H2O • O2S)

Bond type: Hydrogen bond (negative ion to hydride)

Quantity Value Units Method Reference Comment
Δr14.6 ± 0.42kJ/molTDAsBanic and Iribarne, 1985gas phase; B

Free energy of reaction

ΔrG° (kJ/mol) T (K) Method Reference Comment
15.300.HPMSBanic and Iribarne, 1985gas phase; electric fields; M

(Iodide • Sulfur dioxide • Water) + Sulfur dioxide = (Iodide • 2Sulfur dioxide • Water)

By formula: (I- • O2S • H2O) + O2S = (I- • 2O2S • H2O)

Quantity Value Units Method Reference Comment
Δr29.7 ± 0.42kJ/molTDAsBanic and Iribarne, 1985gas phase; B

(Iodide • Sulfur dioxide) + Sulfur dioxide = (Iodide • 2Sulfur dioxide)

By formula: (I- • O2S) + O2S = (I- • 2O2S)

Quantity Value Units Method Reference Comment
Δr42.26 ± 0.42kJ/molTDAsKeesee, Lee, et al., 1980gas phase; B,M
Quantity Value Units Method Reference Comment
Δr90.4J/mol*KHPMSKeesee, Lee, et al., 1980gas phase; M
Quantity Value Units Method Reference Comment
Δr15.1 ± 1.3kJ/molTDAsKeesee, Lee, et al., 1980gas phase; B

(Iodide • 2Sulfur dioxide) + Sulfur dioxide = (Iodide • 3Sulfur dioxide)

By formula: (I- • 2O2S) + O2S = (I- • 3O2S)

Quantity Value Units Method Reference Comment
Δr38.5 ± 0.84kJ/molTDAsKeesee, Lee, et al., 1980gas phase; B,M
Quantity Value Units Method Reference Comment
Δr103.J/mol*KHPMSKeesee, Lee, et al., 1980gas phase; M
Quantity Value Units Method Reference Comment
Δr7.5 ± 2.5kJ/molTDAsKeesee, Lee, et al., 1980gas phase; B

Iodide + sulphur trioxide = IO3S-

By formula: I- + O3S = IO3S-

Quantity Value Units Method Reference Comment
Δr161. ± 8.8kJ/molCIDTHao, Gilbert, et al., 2006gas phase; B

Iodide + Xenon = IXe-

By formula: I- + Xe = IXe-

Quantity Value Units Method Reference Comment
Δr6.69kJ/molN/ALenzer, Furlanetto, et al., 1998gas phase; B
Δr11.7kJ/molTDAsWada, Kikkawa, et al., 2007gas phase; Entropy estimated; B
Quantity Value Units Method Reference Comment
Δr-8.24kJ/molTDAsWada, Kikkawa, et al., 2007gas phase; Entropy estimated; B

Reaction thermochemistry data

Data compiled as indicated in comments:
B - John E. Bartmess
M - Michael M. Meot-Ner (Mautner) and Sharon G. Lias

Reactions 1 to 50

Iodide + Water = (Iodide • Water)

By formula: I- + H2O = (I- • H2O)

Bond type: Hydrogen bond (negative ion to hydride)

Quantity Value Units Method Reference Comment
Δr43. ± 3.kJ/molAVGN/AAverage of 6 values; Individual data points
Quantity Value Units Method Reference Comment
Δr64.0J/mol*KPHPMSHiraoka, Mizuse, et al., 1988gas phase; M
Δr80.8J/mol*KHPMSKeesee and Castleman, 1980gas phase; M
Δr68.2J/mol*KHPMSArshadi, Yamdagni, et al., 1970gas phase; M
Quantity Value Units Method Reference Comment
Δr23. ± 1.kJ/molAVGN/AAverage of 6 values; Individual data points

Free energy of reaction

ΔrG° (kJ/mol) T (K) Method Reference Comment
22.300.HPMSBanic and Iribarne, 1985gas phase; electric fields; M

(Iodide • Water) + Water = (Iodide • 2Water)

By formula: (I- • H2O) + H2O = (I- • 2H2O)

Bond type: Hydrogen bond (negative ion to hydride)

Quantity Value Units Method Reference Comment
Δr41.4 ± 0.84kJ/molTDAsKeesee and Castleman, 1980gas phase; B,M
Δr39.7kJ/molN/AMarkovich, Pollack, et al., 1994gas phase; For photodissociation plus electron loss. Affinity is difference from lower solvated ion.; B
Δr39.7 ± 0.84kJ/molTDAsHiraoka, Mizuse, et al., 1988gas phase; B,M
Δr41. ± 4.2kJ/molTDAsPayzant, Yamdagni, et al., 1971gas phase; B
Δr41. ± 4.2kJ/molTDAsArshadi, Yamdagni, et al., 1970gas phase; B,M
Quantity Value Units Method Reference Comment
Δr73.6J/mol*KPHPMSHiraoka, Mizuse, et al., 1988gas phase; M
Δr84.9J/mol*KHPMSKeesee and Castleman, 1980gas phase; M
Δr79.5J/mol*KHPMSArshadi, Yamdagni, et al., 1970gas phase; M
Quantity Value Units Method Reference Comment
Δr17. ± 2.kJ/molAVGN/AAverage of 6 values; Individual data points

Free energy of reaction

ΔrG° (kJ/mol) T (K) Method Reference Comment
17.300.HPMSBanic and Iribarne, 1985gas phase; electric fields; M

Iodide + Carbon dioxide = (Iodide • Carbon dioxide)

By formula: I- + CO2 = (I- • CO2)

Quantity Value Units Method Reference Comment
Δr15. ± 7.5kJ/molN/APiani, Becucci, et al., 2008gas phase; Stated electron affinity is the Vertical Detachment Energy; B
Δr17. ± 8.4kJ/molPDisArnold, Bradforth, et al., 1995gas phase; EA given is Vertical Detachment Energy. Affinity: difference between successive EAs in (Y); B
Δr20. ± 8.4kJ/molTDAsHiraoka, Mizuse, et al., 1987gas phase; B,M
Δr13.4kJ/molN/AGomez, Taylor, et al., 2002gas phase; EA=Vertical Detachment Energy. Affinity is stepwise difference in EAs.; B
Δr23.4 ± 0.42kJ/molTDAsKeesee, Lee, et al., 1980gas phase; B,M
Quantity Value Units Method Reference Comment
Δr56.1J/mol*KPHPMSHiraoka, Mizuse, et al., 1987gas phase; M
Δr76.1J/mol*KHPMSKeesee, Lee, et al., 1980gas phase; M
Quantity Value Units Method Reference Comment
Δr3. ± 8.4kJ/molTDAsHiraoka, Mizuse, et al., 1987gas phase; B
Δr3.3 ± 0.42kJ/molTDAsBanic and Iribarne, 1985gas phase; B,M
Δr1.7 ± 0.42kJ/molTDAsKeesee, Lee, et al., 1980gas phase; B

(Iodide • 2Water) + Water = (Iodide • 3Water)

By formula: (I- • 2H2O) + H2O = (I- • 3H2O)

Bond type: Hydrogen bond (negative ion to hydride)

Quantity Value Units Method Reference Comment
Δr38.9 ± 1.3kJ/molTDAsKeesee and Castleman, 1980gas phase; B,M
Δr36. ± 9.6kJ/molN/AMarkovich, Pollack, et al., 1994gas phase; For photodissociation plus electron loss. Affinity is difference from lower solvated ion.; B
Δr38.5 ± 0.84kJ/molTDAsHiraoka, Mizuse, et al., 1988gas phase; B,M
Δr39. ± 4.2kJ/molTDAsPayzant, Yamdagni, et al., 1971gas phase; B
Δr39. ± 4.2kJ/molTDAsArshadi, Yamdagni, et al., 1970gas phase; B,M
Quantity Value Units Method Reference Comment
Δr85.4J/mol*KPHPMSHiraoka, Mizuse, et al., 1988gas phase; M
Δr87.9J/mol*KHPMSKeesee and Castleman, 1980gas phase; M
Δr89.1J/mol*KHPMSArshadi, Yamdagni, et al., 1970gas phase; M
Quantity Value Units Method Reference Comment
Δr12.6kJ/molTDAsKeesee and Castleman, 1980gas phase; B
Δr13.0 ± 3.3kJ/molTDAsHiraoka, Mizuse, et al., 1988gas phase; B
Δr14. ± 8.4kJ/molTDAsKebarle, Arshadi, et al., 1968gas phase; B,M

Iodide + Acetonitrile = (Iodide • Acetonitrile)

By formula: I- + C2H3N = (I- • C2H3N)

Quantity Value Units Method Reference Comment
Δr49.8 ± 8.4kJ/molTDAsYamdagni and Kebarle, 1972gas phase; B,M
Δr46.4 ± 1.7kJ/molN/AMarkovich, Perera, et al., 1996gas phase; B
Δr46.4 ± 4.6kJ/molLPESDessent, Bailey, et al., 1995gas phase; B
Δr46.02 ± 0.84kJ/molTDAsHiraoka, Mizuse, et al., 1988gas phase; B,M
Δr50.kJ/molPHPMSCaldwell, Masucci, et al., 1989gas phase; M
Quantity Value Units Method Reference Comment
Δr57.7J/mol*KPHPMSHiraoka, Mizuse, et al., 1988gas phase; M
Δr76.1J/mol*KPHPMSYamdagni and Kebarle, 1972gas phase; M
Quantity Value Units Method Reference Comment
Δr27. ± 8.4kJ/molTDAsYamdagni and Kebarle, 1972gas phase; B
Δr28. ± 8.4kJ/molIMRETanabe, Morgon, et al., 1996gas phase; Anchored to H2O..I- of Caldwell and Kebarle, 1984; B
Δr28.9 ± 2.1kJ/molTDAsHiraoka, Mizuse, et al., 1988gas phase; B

Iodide + Methyl Alcohol = (Iodide • Methyl Alcohol)

By formula: I- + CH4O = (I- • CH4O)

Quantity Value Units Method Reference Comment
Δr49.79 ± 0.84kJ/molTDAsBogdanov, Peschke, et al., 1999gas phase; B
Δr47.3 ± 4.2kJ/molTDAsCaldwell and Kebarle, 1984gas phase; B,M
Δr46.9kJ/molPHPMSHiraoka and Yamabe, 1991gas phase; M
Δr46.kJ/molPHPMSCaldwell, Masucci, et al., 1989gas phase; M
Quantity Value Units Method Reference Comment
Δr71.5J/mol*KPHPMSHiraoka and Yamabe, 1991gas phase; M
Δr74.5J/mol*KPHPMSCaldwell and Kebarle, 1984gas phase; M
Quantity Value Units Method Reference Comment
Δr24.1kJ/molTDAsBogdanov, Peschke, et al., 1999gas phase; B
Δr25. ± 4.2kJ/molTDAsCaldwell and Kebarle, 1984gas phase; B
Δr24. ± 8.4kJ/molIMRETanabe, Morgon, et al., 1996gas phase; Anchored to H2O..I- of Caldwell and Kebarle, 1984; B

Iodide + Methane, iodo- = (Iodide • Methane, iodo-)

By formula: I- + CH3I = (I- • CH3I)

Quantity Value Units Method Reference Comment
Δr35.7 ± 0.84kJ/molN/AVan Duzor, Wei, et al., 2010gas phase; B
Δr32.6 ± 0.84kJ/molTDAsHiraoka, Fujita, et al., 1905gas phase; B
Δr35.1 ± 2.1kJ/molN/AArnold, Neumark, et al., 1995gas phase; ZEKE data, shift relative to bare I-; B
Δr34.7 ± 2.1kJ/molPDisCyr, Bishea, et al., 1992gas phase; B
Δr38. ± 8.4kJ/molTDAsDougherty and Roberts, 1974gas phase; B,M
Quantity Value Units Method Reference Comment
Δr68.6J/mol*KHPMSDougherty and Roberts, 1974gas phase; M
Quantity Value Units Method Reference Comment
Δr11.4 ± 0.84kJ/molTDAsHiraoka, Fujita, et al., 1905gas phase; B
Δr17.2 ± 1.3kJ/molTDAsDougherty and Roberts, 1974gas phase; B

(Iodide • Acetonitrile) + Acetonitrile = (Iodide • 2Acetonitrile)

By formula: (I- • C2H3N) + C2H3N = (I- • 2C2H3N)

Quantity Value Units Method Reference Comment
Δr43.51 ± 0.84kJ/molTDAsHiraoka, Mizuse, et al., 1988gas phase; B,M
Δr46.4 ± 2.9kJ/molN/AMarkovich, Perera, et al., 1996gas phase; B
Δr46.4 ± 1.7kJ/molN/ADessent, Bailey, et al., 1995gas phase; Vertical Detachment Energy: 2.25±0.08 eV.; B
Δr43.93kJ/molTDAsYamdagni and Kebarle, 1972gas phase; B,M
Quantity Value Units Method Reference Comment
Δr77.0J/mol*KPHPMSHiraoka, Mizuse, et al., 1988gas phase; M
Δr87.0J/mol*KPHPMSYamdagni and Kebarle, 1972gas phase; M
Quantity Value Units Method Reference Comment
Δr20.5 ± 3.3kJ/molTDAsHiraoka, Mizuse, et al., 1988gas phase; B
Δr18.0kJ/molTDAsYamdagni and Kebarle, 1972gas phase; B

Iodide + Sulfur dioxide = (Iodide • Sulfur dioxide)

By formula: I- + O2S = (I- • O2S)

Quantity Value Units Method Reference Comment
Δr59.8 ± 8.4kJ/molTDAsCaldwell and Kebarle, 1985gas phase; B,M
Δr53.97 ± 0.42kJ/molTDAsKeesee, Lee, et al., 1980gas phase; B,M
Quantity Value Units Method Reference Comment
Δr73.6J/mol*KPHPMSCaldwell and Kebarle, 1985gas phase; M
Δr84.5J/mol*KHPMSKeesee, Lee, et al., 1980gas phase; M
Quantity Value Units Method Reference Comment
Δr38. ± 11.kJ/molTDAsCaldwell and Kebarle, 1985gas phase; B
Δr7.11 ± 0.42kJ/molTDAsBanic and Iribarne, 1985gas phase; B
Δr28.5 ± 0.84kJ/molTDAsKeesee, Lee, et al., 1980gas phase; B

Free energy of reaction

ΔrG° (kJ/mol) T (K) Method Reference Comment
38.301.HPMSBanic and Iribarne, 1985gas phase; electric fields; M

(Iodide • 2Carbon dioxide) + Carbon dioxide = (Iodide • 3Carbon dioxide)

By formula: (I- • 2CO2) + CO2 = (I- • 3CO2)

Quantity Value Units Method Reference Comment
Δr9.20kJ/molN/AGomez, Taylor, et al., 2002gas phase; EA=Vertical Detachment Energy. Affinity is stepwise difference in EAs.; B
Δr15. ± 8.4kJ/molPDisArnold, Bradforth, et al., 1995gas phase; EA given is Vertical Detachment Energy. Affinity: difference between successive EAs in (Y); B
Δr19. ± 4.2kJ/molTDAsHiraoka, Mizuse, et al., 1987gas phase; B,M
Quantity Value Units Method Reference Comment
Δr77.0J/mol*KPHPMSHiraoka, Mizuse, et al., 1987gas phase; M
Quantity Value Units Method Reference Comment
Δr-3. ± 8.4kJ/molTDAsHiraoka, Mizuse, et al., 1987gas phase; B

(Iodide • 4Carbon dioxide) + Carbon dioxide = (Iodide • 5Carbon dioxide)

By formula: (I- • 4CO2) + CO2 = (I- • 5CO2)

Quantity Value Units Method Reference Comment
Δr7.11kJ/molN/AGomez, Taylor, et al., 2002gas phase; EA=Vertical Detachment Energy. Affinity is stepwise difference in EAs.; B
Δr13. ± 8.4kJ/molPDisArnold, Bradforth, et al., 1995gas phase; EA given is Vertical Detachment Energy. Affinity: difference between successive EAs in (Y); B
Δr18. ± 4.2kJ/molTDAsHiraoka, Mizuse, et al., 1987gas phase; B,M
Quantity Value Units Method Reference Comment
Δr79.5J/mol*KPHPMSHiraoka, Mizuse, et al., 1987gas phase; M
Quantity Value Units Method Reference Comment
Δr-5.9 ± 8.4kJ/molTDAsHiraoka, Mizuse, et al., 1987gas phase; B

(Iodide • Carbon dioxide) + Carbon dioxide = (Iodide • 2Carbon dioxide)

By formula: (I- • CO2) + CO2 = (I- • 2CO2)

Quantity Value Units Method Reference Comment
Δr15. ± 8.4kJ/molPDisArnold, Bradforth, et al., 1995gas phase; EA given is Vertical Detachment Energy. Affinity: difference between successive EAs in (Y); B
Δr20. ± 4.2kJ/molTDAsHiraoka, Mizuse, et al., 1987gas phase; B,M
Δr10.9kJ/molN/AGomez, Taylor, et al., 2002gas phase; EA=Vertical Detachment Energy. Affinity is stepwise difference in EAs.; B
Quantity Value Units Method Reference Comment
Δr72.4J/mol*KPHPMSHiraoka, Mizuse, et al., 1987gas phase; M
Quantity Value Units Method Reference Comment
Δr3. ± 8.4kJ/molTDAsHiraoka, Mizuse, et al., 1987gas phase; B

(Iodide • 3Water) + Water = (Iodide • 4Water)

By formula: (I- • 3H2O) + H2O = (I- • 4H2O)

Bond type: Hydrogen bond (negative ion to hydride)

Quantity Value Units Method Reference Comment
Δr38.5 ± 1.7kJ/molTDAsHiraoka, Mizuse, et al., 1988gas phase; B,M
Δr29. ± 9.6kJ/molN/AMarkovich, Pollack, et al., 1994gas phase; For photodissociation plus electron loss. Affinity is difference from lower solvated ion.; B
Quantity Value Units Method Reference Comment
Δr98.7J/mol*KPHPMSHiraoka, Mizuse, et al., 1988gas phase; M
Quantity Value Units Method Reference Comment
Δr8.8 ± 6.7kJ/molTDAsHiraoka, Mizuse, et al., 1988gas phase; B
Δr9.2 ± 8.4kJ/molTDAsKebarle, Arshadi, et al., 1968gas phase; B,M

(Iodide • 5Carbon dioxide) + Carbon dioxide = (Iodide • 6Carbon dioxide)

By formula: (I- • 5CO2) + CO2 = (I- • 6CO2)

Quantity Value Units Method Reference Comment
Δr13. ± 8.4kJ/molPDisArnold, Bradforth, et al., 1995gas phase; EA given is Vertical Detachment Energy. Affinity: difference between successive EAs in (Y); B
Δr7.53kJ/molN/AGomez, Taylor, et al., 2002gas phase; EA=Vertical Detachment Energy. Affinity is stepwise difference in EAs.; B
Δr18.kJ/molPHPMSHiraoka, Mizuse, et al., 1987gas phase; Entropy change calculated or estimated; M
Quantity Value Units Method Reference Comment
Δr79.J/mol*KN/AHiraoka, Mizuse, et al., 1987gas phase; Entropy change calculated or estimated; M

(Iodide • 2Acetonitrile) + Acetonitrile = (Iodide • 3Acetonitrile)

By formula: (I- • 2C2H3N) + C2H3N = (I- • 3C2H3N)

Quantity Value Units Method Reference Comment
Δr38.5 ± 0.84kJ/molTDAsHiraoka, Mizuse, et al., 1988gas phase; B,M
Δr40.6 ± 2.9kJ/molN/AMarkovich, Perera, et al., 1996gas phase; B
Δr38.9kJ/molTDAsYamdagni and Kebarle, 1972gas phase; B,M
Quantity Value Units Method Reference Comment
Δr83.3J/mol*KPHPMSHiraoka, Mizuse, et al., 1988gas phase; M
Δr92.5J/mol*KPHPMSYamdagni and Kebarle, 1972gas phase; M
Quantity Value Units Method Reference Comment
Δr13.4 ± 3.3kJ/molTDAsHiraoka, Mizuse, et al., 1988gas phase; B
Δr11.3kJ/molTDAsYamdagni and Kebarle, 1972gas phase; B

(Iodide • 4Water) + Water = (Iodide • 5Water)

By formula: (I- • 4H2O) + H2O = (I- • 5H2O)

Bond type: Hydrogen bond (negative ion to hydride)

Quantity Value Units Method Reference Comment
Δr37.7kJ/molTDAsHiraoka, Mizuse, et al., 1988gas phase; Entropy estimated; B,M
Δr17.6kJ/molN/AMarkovich, Pollack, et al., 1994gas phase; For photodissociation plus electron loss. Affinity is difference from lower solvated ion.; B
Quantity Value Units Method Reference Comment
Δr100.J/mol*KN/AHiraoka, Mizuse, et al., 1988gas phase; Entropy change calculated or estimated; M
Quantity Value Units Method Reference Comment
Δr6.28kJ/molTDAsHiraoka, Mizuse, et al., 1988gas phase; Entropy estimated; B

Iodide + Ethanol = (Iodide • Ethanol)

By formula: I- + C2H6O = (I- • C2H6O)

Quantity Value Units Method Reference Comment
Δr54.39 ± 0.84kJ/molTDAsBogdanov, Peschke, et al., 1999gas phase; B
Δr50.6 ± 4.2kJ/molTDAsCaldwell and Kebarle, 1984gas phase; B,M
Quantity Value Units Method Reference Comment
Δr79.1J/mol*KPHPMSCaldwell and Kebarle, 1984gas phase; M
Quantity Value Units Method Reference Comment
Δr25.6kJ/molTDAsBogdanov, Peschke, et al., 1999gas phase; B
Δr27. ± 4.2kJ/molTDAsCaldwell and Kebarle, 1984gas phase; B
Δr25. ± 8.4kJ/molIMRETanabe, Morgon, et al., 1996gas phase; Anchored to H2O..I- of Caldwell and Kebarle, 1984; B

(Iodide • 3Carbon dioxide) + Carbon dioxide = (Iodide • 4Carbon dioxide)

By formula: (I- • 3CO2) + CO2 = (I- • 4CO2)

Quantity Value Units Method Reference Comment
Δr7.53kJ/molN/AGomez, Taylor, et al., 2002gas phase; EA=Vertical Detachment Energy. Affinity is stepwise difference in EAs.; B
Δr15. ± 8.4kJ/molPDisArnold, Bradforth, et al., 1995gas phase; EA given is Vertical Detachment Energy. Affinity: difference between successive EAs in (Y); B
Δr19. ± 4.2kJ/molTDAsHiraoka, Mizuse, et al., 1987gas phase; B
Quantity Value Units Method Reference Comment
Δr-4.2 ± 8.4kJ/molTDAsHiraoka, Mizuse, et al., 1987gas phase; B

Iodide + Iodine = I3-

By formula: I- + I2 = I3-

Quantity Value Units Method Reference Comment
Δr136. ± 10.kJ/molN/ATaylor, Asmis, et al., 1999gas phase; B
Δr126. ± 5.9kJ/molCIDTDo, Klein, et al., 1997gas phase; B
Δr356.1kJ/molTherFinch, Gates, et al., 1977gas phase; This value is far more bound than expected from other studies; B
Δr136.4kJ/molN/ACheck, Faust, et al., 2001gas phase; FeF3-(t); ; ΔS(EA)=2.8; B
Quantity Value Units Method Reference Comment
Δr94.14kJ/molN/ACheck, Faust, et al., 2001gas phase; FeF3-(t); ; ΔS(EA)=2.8; B

Iodide + Phenol, 4-chloro- = (Iodide • Phenol, 4-chloro-)

By formula: I- + C6H5ClO = (I- • C6H5ClO)

Quantity Value Units Method Reference Comment
Δr85.8 ± 7.5kJ/molIMREPaul and Kebarle, 1990gas phase; ΔGaff at 423 K; B,M
Quantity Value Units Method Reference Comment
Δr88.J/mol*KN/APaul and Kebarle, 1990gas phase; Entropy change calculated or estimated; M
Quantity Value Units Method Reference Comment
Δr48.5 ± 4.2kJ/molIMREPaul and Kebarle, 1990gas phase; ΔGaff at 423 K; B

Free energy of reaction

ΔrG° (kJ/mol) T (K) Method Reference Comment
48.5423.PHPMSPaul and Kebarle, 1990gas phase; Entropy change calculated or estimated; M

Iodide + Phenol, 3-chloro- = (Iodide • Phenol, 3-chloro-)

By formula: I- + C6H5ClO = (I- • C6H5ClO)

Quantity Value Units Method Reference Comment
Δr88.3 ± 7.5kJ/molIMREPaul and Kebarle, 1990gas phase; ΔGaff at 423 K; B,M
Quantity Value Units Method Reference Comment
Δr88.J/mol*KN/APaul and Kebarle, 1990gas phase; Entropy change calculated or estimated; M
Quantity Value Units Method Reference Comment
Δr51.0 ± 4.2kJ/molIMREPaul and Kebarle, 1990gas phase; ΔGaff at 423 K; B

Free energy of reaction

ΔrG° (kJ/mol) T (K) Method Reference Comment
51.0423.PHPMSPaul and Kebarle, 1990gas phase; Entropy change calculated or estimated; M

Iodide + Phenol, 4-fluoro- = (Iodide • Phenol, 4-fluoro-)

By formula: I- + C6H5FO = (I- • C6H5FO)

Quantity Value Units Method Reference Comment
Δr82.0 ± 7.5kJ/molIMREPaul and Kebarle, 1990gas phase; ΔGaff at 423 K; B,M
Quantity Value Units Method Reference Comment
Δr88.J/mol*KN/APaul and Kebarle, 1990gas phase; Entropy change calculated or estimated; M
Quantity Value Units Method Reference Comment
Δr44.8 ± 4.2kJ/molIMREPaul and Kebarle, 1990gas phase; ΔGaff at 423 K; B

Free energy of reaction

ΔrG° (kJ/mol) T (K) Method Reference Comment
43.9423.PHPMSPaul and Kebarle, 1990gas phase; Entropy change calculated or estimated; M

Iodide + Phenol, 3-fluoro- = (Iodide • Phenol, 3-fluoro-)

By formula: I- + C6H5FO = (I- • C6H5FO)

Quantity Value Units Method Reference Comment
Δr81.2 ± 7.5kJ/molIMREPaul and Kebarle, 1990gas phase; ΔGaff at 423 K; B,M
Quantity Value Units Method Reference Comment
Δr88.J/mol*KN/APaul and Kebarle, 1990gas phase; Entropy change calculated or estimated; M
Quantity Value Units Method Reference Comment
Δr43.9 ± 4.2kJ/molIMREPaul and Kebarle, 1990gas phase; ΔGaff at 423 K; B

Free energy of reaction

ΔrG° (kJ/mol) T (K) Method Reference Comment
44.8423.PHPMSPaul and Kebarle, 1990gas phase; Entropy change calculated or estimated; M

Iodide + Phenol, 3-nitro- = (Iodide • Phenol, 3-nitro-)

By formula: I- + C6H5NO3 = (I- • C6H5NO3)

Quantity Value Units Method Reference Comment
Δr97.1 ± 7.5kJ/molIMREPaul and Kebarle, 1990gas phase; ΔGaff at 423 K; B,M
Quantity Value Units Method Reference Comment
Δr88.J/mol*KN/APaul and Kebarle, 1990gas phase; Entropy change calculated or estimated; M
Quantity Value Units Method Reference Comment
Δr59.8 ± 4.2kJ/molIMREPaul and Kebarle, 1990gas phase; ΔGaff at 423 K; B

Free energy of reaction

ΔrG° (kJ/mol) T (K) Method Reference Comment
59.8423.PHPMSPaul and Kebarle, 1990gas phase; Entropy change calculated or estimated; M

Iodide + Benzonitrile, 4-hydroxy- = (Iodide • Benzonitrile, 4-hydroxy-)

By formula: I- + C7H5NO = (I- • C7H5NO)

Quantity Value Units Method Reference Comment
Δr99.6 ± 7.5kJ/molIMREPaul and Kebarle, 1990gas phase; ΔGaff at 423 K; B,M
Quantity Value Units Method Reference Comment
Δr88.J/mol*KN/APaul and Kebarle, 1990gas phase; Entropy change calculated or estimated; M
Quantity Value Units Method Reference Comment
Δr62.3 ± 4.2kJ/molIMREPaul and Kebarle, 1990gas phase; ΔGaff at 423 K; B

Free energy of reaction

ΔrG° (kJ/mol) T (K) Method Reference Comment
62.3423.PHPMSPaul and Kebarle, 1990gas phase; Entropy change calculated or estimated; M

Iodide + Benzonitrile, 3-hydroxy- = (Iodide • Benzonitrile, 3-hydroxy-)

By formula: I- + C7H5NO = (I- • C7H5NO)

Quantity Value Units Method Reference Comment
Δr96.2 ± 7.5kJ/molIMREPaul and Kebarle, 1990gas phase; ΔGaff at 423 K; B,M
Quantity Value Units Method Reference Comment
Δr88.J/mol*KN/APaul and Kebarle, 1990gas phase; Entropy change calculated or estimated; M
Quantity Value Units Method Reference Comment
Δr59.0 ± 4.2kJ/molIMREPaul and Kebarle, 1990gas phase; ΔGaff at 423 K; B

Free energy of reaction

ΔrG° (kJ/mol) T (K) Method Reference Comment
59.0423.PHPMSPaul and Kebarle, 1990gas phase; Entropy change calculated or estimated; M

Iodide + p-Cresol = (Iodide • p-Cresol)

By formula: I- + C7H8O = (I- • C7H8O)

Quantity Value Units Method Reference Comment
Δr68.6 ± 7.5kJ/molIMREPaul and Kebarle, 1990gas phase; ΔGaff at 423 K; B,M
Quantity Value Units Method Reference Comment
Δr88.J/mol*KN/APaul and Kebarle, 1990gas phase; Entropy change calculated or estimated; M
Quantity Value Units Method Reference Comment
Δr31. ± 4.2kJ/molIMREPaul and Kebarle, 1990gas phase; ΔGaff at 423 K; B

Free energy of reaction

ΔrG° (kJ/mol) T (K) Method Reference Comment
31.423.PHPMSPaul and Kebarle, 1990gas phase; Entropy change calculated or estimated; M

Iodide + Phenol = (Iodide • Phenol)

By formula: I- + C6H6O = (I- • C6H6O)

Quantity Value Units Method Reference Comment
Δr72.4 ± 7.5kJ/molIMREPaul and Kebarle, 1990gas phase; ΔGaff at 423 K; B,M
Quantity Value Units Method Reference Comment
Δr88.J/mol*KN/APaul and Kebarle, 1990gas phase; Entropy change calculated or estimated; M
Quantity Value Units Method Reference Comment
Δr35. ± 4.2kJ/molIMREPaul and Kebarle, 1990gas phase; ΔGaff at 423 K; B

Free energy of reaction

ΔrG° (kJ/mol) T (K) Method Reference Comment
35.423.PHPMSPaul and Kebarle, 1990gas phase; Entropy change calculated or estimated; M

Iodide + Hydrogen bromide = (Iodide • Hydrogen bromide)

By formula: I- + HBr = (I- • HBr)

Bond type: Hydrogen bond (negative ion to hydride)

Quantity Value Units Method Reference Comment
Δr67.4 ± 8.4kJ/molTDEqCaldwell and Kebarle, 1985gas phase; B,M
Quantity Value Units Method Reference Comment
Δr82.0J/mol*KPHPMSCaldwell and Kebarle, 1985gas phase; switching reaction(I-)SO2; M
Quantity Value Units Method Reference Comment
Δr43. ± 11.kJ/molTDEqCaldwell and Kebarle, 1985gas phase; B

Free energy of reaction

ΔrG° (kJ/mol) T (K) Method Reference Comment
42.7300.PHPMSCaldwell and Kebarle, 1985gas phase; switching reaction(I-)SO2; M

Iodide + Hydrogen iodide = (Iodide • Hydrogen iodide)

By formula: I- + HI = (I- • HI)

Bond type: Hydrogen bond (negative ion to hydride)

Quantity Value Units Method Reference Comment
Δr71.1 ± 8.4kJ/molTDEqCaldwell and Kebarle, 1985gas phase; B,M
Quantity Value Units Method Reference Comment
Δr102.J/mol*KPHPMSCaldwell and Kebarle, 1985gas phase; switching reaction(I-)SO2; M
Quantity Value Units Method Reference Comment
Δr41. ± 11.kJ/molTDEqCaldwell and Kebarle, 1985gas phase; B

Free energy of reaction

ΔrG° (kJ/mol) T (K) Method Reference Comment
41.300.PHPMSCaldwell and Kebarle, 1985gas phase; switching reaction(I-)SO2; M

Iodide + Hydrogen cation = Hydrogen iodide

By formula: I- + H+ = HI

Quantity Value Units Method Reference Comment
Δr1315.24 ± 0.084kJ/molD-EAPelaez, Blondel, et al., 2009gas phase; Given: 3.0590463(38) eV; B
Δr1312.1kJ/molN/ACheck, Faust, et al., 2001gas phase; Fe(CO)2-(q); ; ΔS(EA)=5.0; B
Quantity Value Units Method Reference Comment
Δr1294.03 ± 0.25kJ/molH-TSPelaez, Blondel, et al., 2009gas phase; Given: 3.0590463(38) eV; B
Δr1290.8kJ/molN/ACheck, Faust, et al., 2001gas phase; Fe(CO)2-(q); ; ΔS(EA)=5.0; B

Iodide + Hydrogen chloride = (Iodide • Hydrogen chloride)

By formula: I- + HCl = (I- • HCl)

Bond type: Hydrogen bond (negative ion to hydride)

Quantity Value Units Method Reference Comment
Δr61.9 ± 8.4kJ/molTDAsCaldwell and Kebarle, 1985gas phase; B,M
Δr59.4kJ/molHPMSKeesee, Lee, et al., 1980gas phase; M
Quantity Value Units Method Reference Comment
Δr83.7J/mol*KPHPMSCaldwell and Kebarle, 1985gas phase; M
Δr95.0J/mol*KHPMSKeesee, Lee, et al., 1980gas phase; M
Quantity Value Units Method Reference Comment
Δr37. ± 11.kJ/molTDAsCaldwell and Kebarle, 1985gas phase; B

(Iodide • 2Nitrous oxide) + Nitrous oxide = (Iodide • 3Nitrous oxide)

By formula: (I- • 2N2O) + N2O = (I- • 3N2O)

Quantity Value Units Method Reference Comment
Δr11. ± 8.4kJ/molPDisArnold, Bradforth, et al., 1995gas phase; EA given is Vertical Detachment Energy. Affinity: difference between successive EAs in (Y); B
Δr13.kJ/molPHPMSHiraoka, Aruga, et al., 1993gas phase; Entropy change calculated or estimated; M
Quantity Value Units Method Reference Comment
Δr63.J/mol*KN/AHiraoka, Aruga, et al., 1993gas phase; Entropy change calculated or estimated; M

(Iodide • 2Methyl Alcohol) + Methyl Alcohol = (Iodide • 3Methyl Alcohol)

By formula: (I- • 2CH4O) + CH4O = (I- • 3CH4O)

Quantity Value Units Method Reference Comment
Δr32.2 ± 2.5kJ/molTDAsBogdanov, Peschke, et al., 1999gas phase; B
Δr41. ± 4.2kJ/molTDAsHiraoka and Yamabe, 1991gas phase; B,M
Quantity Value Units Method Reference Comment
Δr93.7J/mol*KPHPMSHiraoka and Yamabe, 1991gas phase; M
Quantity Value Units Method Reference Comment
Δr14.3kJ/molTDAsBogdanov, Peschke, et al., 1999gas phase; B
Δr13. ± 8.4kJ/molTDAsHiraoka and Yamabe, 1991gas phase; B

(Iodide • Methyl Alcohol) + Methyl Alcohol = (Iodide • 2Methyl Alcohol)

By formula: (I- • CH4O) + CH4O = (I- • 2CH4O)

Quantity Value Units Method Reference Comment
Δr39.7 ± 0.84kJ/molTDAsBogdanov, Peschke, et al., 1999gas phase; B
Δr46.4 ± 4.2kJ/molTDAsHiraoka and Yamabe, 1991gas phase; B,M
Quantity Value Units Method Reference Comment
Δr94.6J/mol*KPHPMSHiraoka and Yamabe, 1991gas phase; M
Quantity Value Units Method Reference Comment
Δr17.8kJ/molTDAsBogdanov, Peschke, et al., 1999gas phase; B
Δr18. ± 8.4kJ/molTDAsHiraoka and Yamabe, 1991gas phase; B

Iodide + Formic acid = (Iodide • Formic acid)

By formula: I- + CH2O2 = (I- • CH2O2)

Quantity Value Units Method Reference Comment
Δr79.1 ± 4.2kJ/molTDAsCaldwell and Kebarle, 1984gas phase; B,M
Δr54.0 ± 8.8kJ/molCIDTWalker and Sunderlin, 1999gas phase; Authors suggest real value somewhere between this and Caldwell and Kebarle, 1984; B
Quantity Value Units Method Reference Comment
Δr86.6J/mol*KPHPMSCaldwell and Kebarle, 1984gas phase; M
Quantity Value Units Method Reference Comment
Δr53.1 ± 4.2kJ/molTDAsCaldwell and Kebarle, 1984gas phase; B

Iodide + Isopropyl Alcohol = (Iodide • Isopropyl Alcohol)

By formula: I- + C3H8O = (I- • C3H8O)

Quantity Value Units Method Reference Comment
Δr54.81 ± 0.84kJ/molTDAsBogdanov, Peschke, et al., 1999gas phase; B
Δr51.0 ± 4.2kJ/molTDAsCaldwell and Kebarle, 1984gas phase; B,M
Quantity Value Units Method Reference Comment
Δr79.9J/mol*KPHPMSCaldwell and Kebarle, 1984gas phase; M
Quantity Value Units Method Reference Comment
Δr26.5kJ/molTDAsBogdanov, Peschke, et al., 1999gas phase; B
Δr27. ± 4.2kJ/molTDAsCaldwell and Kebarle, 1984gas phase; B

Iodide + 2-Propanol, 2-methyl- = (Iodide • 2-Propanol, 2-methyl-)

By formula: I- + C4H10O = (I- • C4H10O)

Quantity Value Units Method Reference Comment
Δr54.8 ± 1.3kJ/molTDAsBogdanov, Peschke, et al., 1999gas phase; B
Δr50.6 ± 4.2kJ/molTDAsCaldwell and Kebarle, 1984gas phase; B,M
Quantity Value Units Method Reference Comment
Δr78.2J/mol*KPHPMSCaldwell and Kebarle, 1984gas phase; M
Quantity Value Units Method Reference Comment
Δr25.7kJ/molTDAsBogdanov, Peschke, et al., 1999gas phase; B
Δr27. ± 4.2kJ/molTDAsCaldwell and Kebarle, 1984gas phase; B

Iodide + Ammonia = (Iodide • Ammonia)

By formula: I- + H3N = (I- • H3N)

Bond type: Hydrogen bond (negative ion to hydride)

Quantity Value Units Method Reference Comment
Δr31.0 ± 1.3kJ/molTDAsEvans, Keesee, et al., 1987gas phase; B,M
Δr31. ± 4.2kJ/molTDAsCaldwell, Masucci, et al., 1989gas phase; B,M
Quantity Value Units Method Reference Comment
Δr87.4J/mol*KHPMSEvans, Keesee, et al., 1987gas phase; M
Quantity Value Units Method Reference Comment
Δr5.0 ± 2.5kJ/molTDAsEvans, Keesee, et al., 1987gas phase; B

(Iodide • 6Carbon dioxide) + Carbon dioxide = (Iodide • 7Carbon dioxide)

By formula: (I- • 6CO2) + CO2 = (I- • 7CO2)

Quantity Value Units Method Reference Comment
Δr14. ± 8.4kJ/molPDisArnold, Bradforth, et al., 1995gas phase; EA given is Vertical Detachment Energy. Affinity: difference between successive EAs in (Y); B
Δr7.95kJ/molN/AGomez, Taylor, et al., 2002gas phase; EA=Vertical Detachment Energy. Affinity is stepwise difference in EAs.; B

(Iodide • 7Carbon dioxide) + Carbon dioxide = (Iodide • 8Carbon dioxide)

By formula: (I- • 7CO2) + CO2 = (I- • 8CO2)

Quantity Value Units Method Reference Comment
Δr13. ± 8.4kJ/molPDisArnold, Bradforth, et al., 1995gas phase; EA given is Vertical Detachment Energy. Affinity: difference between successive EAs in (Y); B
Δr7.95kJ/molN/AGomez, Taylor, et al., 2002gas phase; EA=Vertical Detachment Energy. Affinity is stepwise difference in EAs.; B

(Iodide • Nitrous oxide) + Nitrous oxide = (Iodide • 2Nitrous oxide)

By formula: (I- • N2O) + N2O = (I- • 2N2O)

Quantity Value Units Method Reference Comment
Δr12. ± 8.4kJ/molPDisArnold, Bradforth, et al., 1995gas phase; EA given is Vertical Detachment Energy. Affinity: difference between successive EAs in (Y); B
Δr14. ± 1.kJ/molPHPMSHiraoka, Aruga, et al., 1993gas phase; M
Quantity Value Units Method Reference Comment
Δr59.4J/mol*KPHPMSHiraoka, Aruga, et al., 1993gas phase; M

(Iodide • 7Methyl Alcohol) + Methyl Alcohol = (Iodide • 8Methyl Alcohol)

By formula: (I- • 7CH4O) + CH4O = (I- • 8CH4O)

Quantity Value Units Method Reference Comment
Δr38. ± 4.2kJ/molTDAsHiraoka and Yamabe, 1991gas phase; Entropy estimated.; B,M
Quantity Value Units Method Reference Comment
Δr120.J/mol*KN/AHiraoka and Yamabe, 1991gas phase; Entropy change calculated or estimated; M
Quantity Value Units Method Reference Comment
Δr3. ± 8.4kJ/molTDAsHiraoka and Yamabe, 1991gas phase; Entropy estimated.; B

(Iodide • 3Acetonitrile) + Acetonitrile = (Iodide • 4Acetonitrile)

By formula: (I- • 3C2H3N) + C2H3N = (I- • 4C2H3N)

Quantity Value Units Method Reference Comment
Δr32.6 ± 0.42kJ/molTDAsHiraoka, Mizuse, et al., 1988gas phase; B,M
Δr31.0 ± 3.3kJ/molN/AMarkovich, Perera, et al., 1996gas phase; B
Quantity Value Units Method Reference Comment
Δr80.8J/mol*KPHPMSHiraoka, Mizuse, et al., 1988gas phase; M
Quantity Value Units Method Reference Comment
Δr8.4 ± 1.7kJ/molTDAsHiraoka, Mizuse, et al., 1988gas phase; B

(Iodide • 4Acetonitrile) + Acetonitrile = (Iodide • 5Acetonitrile)

By formula: (I- • 4C2H3N) + C2H3N = (I- • 5C2H3N)

Quantity Value Units Method Reference Comment
Δr29.7 ± 1.3kJ/molTDAsHiraoka, Mizuse, et al., 1988gas phase; B,M
Δr44.4 ± 3.8kJ/molN/AMarkovich, Perera, et al., 1996gas phase; B
Quantity Value Units Method Reference Comment
Δr79.1J/mol*KPHPMSHiraoka, Mizuse, et al., 1988gas phase; M
Quantity Value Units Method Reference Comment
Δr5.9 ± 5.9kJ/molTDAsHiraoka, Mizuse, et al., 1988gas phase; B

Iodide + Nitrous oxide = (Iodide • Nitrous oxide)

By formula: I- + N2O = (I- • N2O)

Quantity Value Units Method Reference Comment
Δr11. ± 8.4kJ/molPDisArnold, Bradforth, et al., 1995gas phase; EA given is Vertical Detachment Energy. Affinity: difference between successive EAs in (Y); B
Δr16. ± 1.kJ/molPHPMSHiraoka, Aruga, et al., 1993gas phase; M
Quantity Value Units Method Reference Comment
Δr59.0J/mol*KPHPMSHiraoka, Aruga, et al., 1993gas phase; M

Iodide + Benzene = (Iodide • Benzene)

By formula: I- + C6H6 = (I- • C6H6)

Quantity Value Units Method Reference Comment
Δr26. ± 8.4kJ/molTDAsHiraoka, Mizuse, et al., 1988, 2gas phase; B,M
Δr38. ± 4.2kJ/molTDAsCaldwell, Masucci, et al., 1989gas phase; B,M
Quantity Value Units Method Reference Comment
Δr59.4J/mol*KPHPMSHiraoka, Mizuse, et al., 1988, 2gas phase; M
Quantity Value Units Method Reference Comment
Δr8. ± 11.kJ/molTDAsHiraoka, Mizuse, et al., 1988, 2gas phase; B

Iodide + Dimethyl Sulfoxide = (Iodide • Dimethyl Sulfoxide)

By formula: I- + C2H6OS = (I- • C2H6OS)

Quantity Value Units Method Reference Comment
Δr65.69kJ/molTDAsMagnera, Caldwell, et al., 1984gas phase; B,M
Δr67.kJ/molPHPMSCaldwell, Masucci, et al., 1989gas phase; M
Quantity Value Units Method Reference Comment
Δr90.8J/mol*KPHPMSMagnera, Caldwell, et al., 1984gas phase; M
Quantity Value Units Method Reference Comment
Δr38.5kJ/molTDAsMagnera, Caldwell, et al., 1984gas phase; B

Iodide = BrI2-

By formula: I- = BrI2-

Quantity Value Units Method Reference Comment
Δr141.8 ± 0.96kJ/molPDisCrider, Harrison, et al., 2011gas phase; B
Δr149.4kJ/molN/ACheck, Faust, et al., 2001gas phase; FeF2-(q); ; ΔS(EA)=4.5; B
Quantity Value Units Method Reference Comment
Δr107.9kJ/molN/ACheck, Faust, et al., 2001gas phase; FeF2-(q); ; ΔS(EA)=4.5; B

Iodide + Xenon = IXe-

By formula: I- + Xe = IXe-

Quantity Value Units Method Reference Comment
Δr6.69kJ/molN/ALenzer, Furlanetto, et al., 1998gas phase; B
Δr11.7kJ/molTDAsWada, Kikkawa, et al., 2007gas phase; Entropy estimated; B
Quantity Value Units Method Reference Comment
Δr-8.24kJ/molTDAsWada, Kikkawa, et al., 2007gas phase; Entropy estimated; B

Gas phase thermochemistry data

Quantity Value Units Method Reference Comment
gas,1 bar169.26J/mol*KReviewChase, 1998Data last reviewed in June, 1982

Gas phase ion energetics data

Data compiled by: John E. Bartmess

Protonation reactions

Iodide + Hydrogen cation = Hydrogen iodide

By formula: I- + H+ = HI

Quantity Value Units Method Reference Comment
Δr314.350 ± 0.020kcal/molD-EAPelaez, Blondel, et al., 2009gas phase; Given: 3.0590463(38) eV
Δr313.60kcal/molN/ACheck, Faust, et al., 2001gas phase; Fe(CO)2-(q); ; ΔS(EA)=5.0
Quantity Value Units Method Reference Comment
Δr309.280 ± 0.060kcal/molH-TSPelaez, Blondel, et al., 2009gas phase; Given: 3.0590463(38) eV
Δr308.50kcal/molN/ACheck, Faust, et al., 2001gas phase; Fe(CO)2-(q); ; ΔS(EA)=5.0

References

Crider, Harrison, et al., 2011
Crider, P.E.; Harrison, A.W.; Neumark, D.M., Two- and three-body photodissociation dynamics of diiodobromide (I2Br-) anion, J. Chem. Phys., 2011, 134, 13, 134306, https://doi.org/10.1063/1.3571474 . [all data]

Check, Faust, et al., 2001
Check, C.E.; Faust, T.O.; Bailey, J.M.; Wright, B.J.; Gilbert, T.M.; Sunderlin, L.S., Addition of Polarization and Diffuse Functions to the LANL2DZ Basis Set for P-Block Elements, J. Phys. Chem. A,, 2001, 105, 34, 8111, https://doi.org/10.1021/jp011945l . [all data]

Van Duzor, Wei, et al., 2010
Van Duzor, M.; Wei, J.; Mbaiwa, F.; Mabbs, R., I-center dot CH3X (X=Cl, Br, I) photodetachment: The effect of electron-molecule interactions in cluster anion photodetachment spectra and angular distributions, J. Chem. Phys., 2010, 133, 14, 144303, https://doi.org/10.1063/1.3487739 . [all data]

Piani, Becucci, et al., 2008
Piani, G.; Becucci, M.; Bowen, M.S.; Oakman, J.; Hu, Q.; Continetti, R.E., Photodetachment and dissociation dynamics of microsolvated iodide clusters, Phys. Scripta, 2008, 78, 5, 058110, https://doi.org/10.1088/0031-8949/78/05/058110 . [all data]

Miller, Leopold, et al., 1986
Miller, T.M.; Leopold, D.G.; Murray, K.K.; Lineberger, W.C., Electron Affinities of the Alkali Halides and the Structure of their Negative Ions, J. Chem. Phys., 1986, 85, 5, 2368, https://doi.org/10.1063/1.451091 . [all data]

Zhao, Yourshaw, et al., 1994
Zhao, Y.X.; Yourshaw, I.; Reiser, G.; Arnold, C.C.; Neumark, D.M., Study of the ArBr(-), ArI(-), and KrI(-) anions and the corresponding neutral van der Waals complexes by anion zero electron kinetic energy, J. Chem. Phys., 1994, 101, 8, 6538, https://doi.org/10.1063/1.468500 . [all data]

Caldwell, Masucci, et al., 1989
Caldwell, G.W.; Masucci, J.A.; Ikonomou, M.G., Negative Ion Chemical Ionization Mass Spectrometry - Binding of Molecules to Bromide and Iodide Anions, Org. Mass Spectrom., 1989, 24, 1, 8, https://doi.org/10.1002/oms.1210240103 . [all data]

Meot-ner, Cybulski, et al., 1988
Meot-ner, M.; Cybulski, S.M.; Scheiner, S.; Liebman, J.F., Is CN- Significantly Anisotropic? Comparison of CN- vs. Cl-: Clustering with HCN and Condensed Phase Thermochemistry, J. Phys. Chem., 1988, 92, 10, 2738, https://doi.org/10.1021/j100321a009 . [all data]

Caldwell and Kebarle, 1984
Caldwell, G.; Kebarle, P., Binding energies and structural effects in halide anion-ROH and -RCOOH complexes from gas phase equilibria measurements, J. Am. Chem. Soc., 1984, 106, 967. [all data]

Walker and Sunderlin, 1999
Walker, B.W.; Sunderlin, L.S., The thermochemistry of formic acid halide anion clusters, Int. J. Mass Spectrom., 1999, 184, 2-3, 183-189, https://doi.org/10.1016/S1387-3806(99)00008-1 . [all data]

Cyr, Bishea, et al., 1992
Cyr, D.M.; Bishea, G.A.; Scarton, M.G.; Johnson, M.A., Observation of Charge-Transfer Excited States in the I-.CH3I, I-.CH3Br, and I-.CH2Br2 S(N)2 Reaction Intermediates Using Photofragmentation, J. Chem. Phys., 1992, 97, 8, 5911, https://doi.org/10.1063/1.463752 . [all data]

Hiraoka, Fujita, et al., 1905
Hiraoka, K.; Fujita, K.; Ishida, M.; Ichikawa, T.; Okada, H.; Hiizumi, K.; Wada, A.; Takao, K.; Yamabe, S.; Tsuchida, N., Gas-phase Ion/Molecule Reactions in C5F8, J. Phys. Chem. A (2005), 1905, 109, 6, 1049-1056., https://doi.org/10.1021/jp040251k . [all data]

Arnold, Neumark, et al., 1995
Arnold, C.C.; Neumark, D.M.; Cyr, D.M.; Johnson, M.A., Negative ion zero electron kinetic energy spectroscopy of I-center dot CH3I, J. Phys. Chem., 1995, 99, 6, 1633, https://doi.org/10.1021/j100006a002 . [all data]

Dougherty and Roberts, 1974
Dougherty, R.C.; Roberts, J.D., SN2 reactions in the gas phase. Nucleophilicity effects, Org. Mass Spectrom., 1974, 8, 81. [all data]

Bogdanov, Peschke, et al., 1999
Bogdanov, B.; Peschke, M.; Tonner, D.S.; Szulejko, J.E.; McMahon, T.B., Stepwise solvation of halides by alcohol molecules in the gas phase, Int. J. Mass Spectrom., 1999, 187, 707-725, https://doi.org/10.1016/S1387-3806(98)14180-5 . [all data]

Hiraoka and Yamabe, 1991
Hiraoka, K.; Yamabe, S., Solvation of Halide Ions with CH3OH in the gas Phase, Int. J. Mass Spectrom. Ion Proc., 1991, 109, 133, https://doi.org/10.1016/0168-1176(91)85101-Q . [all data]

Tanabe, Morgon, et al., 1996
Tanabe, F.K.J.; Morgon, N.H.; Riveros, J.M., Relative Bromide and Iodide Affinity of Simple Solvent Molecules Determined by FT-ICR, J. Phys. Chem., 1996, 100, 8, 2862-2866, https://doi.org/10.1021/jp952290p . [all data]

Hiraoka, Mizuno, et al., 2001
Hiraoka, K.; Mizuno, T.; Iino, T.; Eguchi, D.; Yamabe, S., Characteristic changes of bond energies for gas-phase cluster ions of halide ions with methane and chloromethanes, J. Phys. Chem. A, 2001, 105, 20, 4887-4893, https://doi.org/10.1021/jp010143n . [all data]

Arnold, Bradforth, et al., 1995
Arnold, D.W.; Bradforth, S.E.; Kim, E.H.; Neumark, D.M., Study of I-(CO2)n, Br-(CO2)n, and I-(N2O)n clusters by anion photoelectron spectroscopy, J. Chem. Phys., 1995, 102, 9, 3510, https://doi.org/10.1063/1.468576 . [all data]

Hiraoka, Mizuse, et al., 1987
Hiraoka, K.; Mizuse, S.; Yamabe, S., Stability and Structure of Cluster Ions: Halide Ions with CO2, J. Chem. Phys., 1987, 87, 6, 3647, https://doi.org/10.1063/1.452962 . [all data]

Gomez, Taylor, et al., 2002
Gomez, H.; Taylor, T.R.; Neumark, D.M., Anion photoelectron spectroscopy of I-2(-)(CO2)(n)(n=1-8) clusters, J. Chem. Phys., 2002, 116, 14, 6111-6117, https://doi.org/10.1063/1.1458246 . [all data]

Keesee, Lee, et al., 1980
Keesee, R.G.; Lee, N.; Castleman, A.W., Jr., Properties of clusters in the gas phase: V. Complexes of neutral molecules onto negative ions, J. Chem. Phys., 1980, 73, 2195. [all data]

Banic and Iribarne, 1985
Banic, C.M.; Iribarne, J.V., Equilibrium Constants for Clustering of Neutral Molecules about Gaseous Ions, J. Chem. Phys., 1985, 83, 12, 6432, https://doi.org/10.1063/1.449543 . [all data]

Hiraoka, Fujimaki, et al., 1993
Hiraoka, K.; Fujimaki, S.; Aruga, K.; Yamabe, S., Bond Strengths of the Gas-Phase Cluster Ions X-(CS2)n (X = F, Cl, Br and I), Chem. Phys. Lett., 1993, 208, 5-6, 491, https://doi.org/10.1016/0009-2614(93)87178-6 . [all data]

Yamdagni and Kebarle, 1972
Yamdagni, R.; Kebarle, P., Solvation of negative ions by protic and aprotic solvents. Gas phase solvation of halide ions by acetonitrile and water molecules, J. Am. Chem. Soc., 1972, 94, 2940. [all data]

Markovich, Perera, et al., 1996
Markovich, G.; Perera, L.; Berkowitz, M.L.; Cheshnovsky, O., The Solvation of Cl-, Br-, and I- in Acetonitrile Cluster: Photoelectron Spectroscopy and Molecular Dynamics Simulations., J. Chem. Phys., 1996, 105, 7, 2675, https://doi.org/10.1063/1.472131 . [all data]

Dessent, Bailey, et al., 1995
Dessent, C.E.H.; Bailey, C.G.; Johnson, M.A., Dipole-bound excited states of the I-center dot CH3CN and I-center dot(CH3CN)2 ion-molecule complexes: Evidence for asymmetric solvation, J. Chem. Phys., 1995, 103, 6, 2006, https://doi.org/10.1063/1.469727 . [all data]

Hiraoka, Mizuse, et al., 1988
Hiraoka, K.; Mizuse, S.; Yamabe, S., Solvation of Halide Ions with H2O and CH3CN in the Gas Phase, J. Phys. Chem., 1988, 92, 13, 3943, https://doi.org/10.1021/j100324a051 . [all data]

Magnera, Caldwell, et al., 1984
Magnera, T.F.; Caldwell, G.; Sumner, J.; Ikuta, S.; Kebarle, P., Solvation of the halide anions in dimethyl sulfoxide. Factors involved in enhanced reactivity of negative ions in dipolar aprotic solvents, J. Am. Chem. Soc., 1984, 106, 6140. [all data]

Hiraoka, Takao, et al., 2002
Hiraoka, K.; Takao, K.; Lino, T.; Nakagawa, F.; Suyama, H.; Mizuno, T.; Yamabe, S., Gas-phase ion-molecule reactions in C3F6, J. Phys. Chem. A, 2002, 106, 4, 603-611, https://doi.org/10.1021/jp0116306 . [all data]

Hiraoka, Mizuse, et al., 1987, 2
Hiraoka, K.; Mizuse, S.; Yamabe, S., High Symmetric Structure of the Gas Phase Ion Cluster X-..C6F6 (X = Cl, Br, I), J. Phys. Chem., 1987, 91, 20, 5294, https://doi.org/10.1021/j100304a032 . [all data]

Paul and Kebarle, 1990
Paul, G.J.C.; Kebarle, P., Stabilities in the Gas Phase of the Hydrogen Bonded Complexes, YC6H4OH-X-, of Substituted Phenols, YC6H4OH, with the Halide Anions X-(Cl-, Br-), Can. J. Chem., 1990, 68, 11, 2070, https://doi.org/10.1139/v90-316 . [all data]

Hiraoka, Mizuse, et al., 1988, 2
Hiraoka, K.; Mizuse, S.; Yamabe, S., Determination of the Stabilities and Structures of X-(C6H6) Clusters (X = Cl, Br, and I), Chem. Phys. Lett., 1988, 147, 2-3, 174, https://doi.org/10.1016/0009-2614(88)85078-4 . [all data]

Chantry, 1976
Chantry, P.J., Negative Ion Formation in Cerium Triiodide, J. Chem. Phys., 1976, 65, 11, 4412, https://doi.org/10.1063/1.432992 . [all data]

Wang, Wang, et al., 2010
Wang, Y.L.; Wang, X.B.; Xing, X.P.; Wei, F.; Li, J.; Wang, L.S., Photoelectron Imaging and Spectroscopy of MI2- (M = Cs, Cu, Au): Evolution from Ionic to Covalent Bonding, J. Phys. Chem. A, 2010, 114, 42, 11244-11251, https://doi.org/10.1021/jp103173d . [all data]

Gusarov, Gorokhov, et al., 1979
Gusarov, A.V.; Gorokhov, L.N.; Pyatenko, A.T.; Sidorova, I.V., Negative ions in the vapors of inorganic compounds, Adv. Mass Spectrom., 1979, 8, 262. [all data]

Lelik, Korobov, et al., 1984
Lelik, L.; Korobov, M.V.; Kaposi, O.; Sidorov, L.N., Negative Ions in the Gas Phase of Dysprosium Triiodide and of the CsI-DyI3 and CsI-NaI-DyI3 Systems, Russ. J. Phys. Chem., 1984, 58, 1164. [all data]

Caldwell and Kebarle, 1985
Caldwell, G.; Kebarle, P., The hydrogen bond energies of the bihalide ions XHX- and YHX-, Can. J. Chem., 1985, 63, 1399. [all data]

Larson and McMahon, 1984
Larson, J.W.; McMahon, T.B., Gas phase bihalide and pseudohalide ions. An ICR determination of hydrogen bond energies in XHY- species (X,Y = F, Cl, Br, CN), Inorg. Chem., 1984, 23, 2029. [all data]

Keesee and Castleman, 1980
Keesee, R.G.; Castleman, A.W., Jr., Gas phase studies of hydration complexes of Cl- and I- and comparison to electrostatic calculations in the gas phase, Chem. Phys. Lett., 1980, 74, 139. [all data]

Arshadi, Yamdagni, et al., 1970
Arshadi, M.; Yamdagni, R.; Kebarle, P., Hydration of Halide Negative Ions in the Gas Phase. II. Comparison of Hydration Energies for the Alkali Positive and Halide Negative Ions, J. Phys. Chem., 1970, 74, 7, 1475, https://doi.org/10.1021/j100702a014 . [all data]

Markovich, Pollack, et al., 1994
Markovich, G.; Pollack, S.; Giniger, R.; Cheshnovsky, O., Photoelectron spectroscopy of Cl-, Br-, and I- solvated in water clusters, J. Chem. Phys., 1994, 101, 11, 9344, https://doi.org/10.1063/1.467965 . [all data]

Payzant, Yamdagni, et al., 1971
Payzant, J.D.; Yamdagni, R.; Kebarle, P., Hydration of CN-, NO2-, NO3-, and HO- in the gas phase, Can. J. Chem., 1971, 49, 3308. [all data]

Kebarle, Arshadi, et al., 1968
Kebarle, P.; Arshadi, M.; Scarborough, J., Hydration of Negative Ions in the Gas Phase, J. Chem. Phys., 1968, 49, 2, 817, https://doi.org/10.1063/1.1670145 . [all data]

Evans, Keesee, et al., 1987
Evans, D.H.; Keesee, R.G.; Castleman Jr., The Association of Ammonia with Halide Ions in the Gas Phase, J. Chem. Phys., 1987, 86, 5, 2927, https://doi.org/10.1063/1.452043 . [all data]

Bencze, Kaposi, et al., 1988
Bencze, L.; Kaposi, O.; Popovic, A.; Borshchevsky, Ya.A.; Sidorov, L.N., Molecule-Molecule and Negative Ion-Molecule Equilibria in the Saturated Vapor above CsI-HoI3 Mixtures, High Temp. Sci., 1988, 25, 199. [all data]

Pramann and Rademann, 1999
Pramann, A.; Rademann, K., Mass-spectrometric study of formation and stability of manganese and manganese oxide cluster anions, Int. J. Mass Spectrom., 1999, 187, 673-683, https://doi.org/10.1016/S1387-3806(98)14197-0 . [all data]

Burdukovskaya, Kudin, et al., 1984
Burdukovskaya, G.G.; Kudin, L.S.; Butman, M.F.; Krasnov, K.S., Ionic forms in the vapour over potassium iodide, Russ. J. Inorg. Chem., 1984, 29, 3020. [all data]

Downs and Adams, 1973
Downs, A.J.; Adams, G.J., Comprehensive Inorganic Chemistry, J. C. Bailar, H. J. Emeleus, R. Nyholm and A. F. Trotman - Dickerson, ed(s)., Pergamon Press, New York, 1973, 1543. [all data]

Taylor, Asmis, et al., 1999
Taylor, T.R.; Asmis, K.R.; Zanni, M.T.; Neumark, D.M., Characterization of the I-3 radical by anion photoelectron spectroscopy, J. Chem. Phys., 1999, 110, 16, 7607-7609, https://doi.org/10.1063/1.478672 . [all data]

Do, Klein, et al., 1997
Do, K.; Klein, T.P.; Pommerening, C.A.; Sunderlin, L.S., A New Flowing Afterglow-Guided Ion Beam Tandem Mass Spectrometer. Applications to the Thermochemistry of Polyiodide Ions, J. Am. Soc. Mass Spectrom., 1997, 8, 7, 688, https://doi.org/10.1016/S1044-0305(97)00116-5 . [all data]

Finch, Gates, et al., 1977
Finch, A.; Gates, P.N.; Peake, S.J., Thermochemistry of polyhalides. III. Cesium and rubidium tetrachloroiodates, J. Inorg. Nucl. Chem., 1977, 39, 2135. [all data]

Heil, Check, et al., 2002
Heil, T.E.; Check, C.E.; Lobring, K.C.; Sunderlin, L.S., The thermochemistry of phosphorus tetrahalide anions, J. Phys. Chem. A, 2002, 106, 42, 10043-10048, https://doi.org/10.1021/jp021386y . [all data]

Hiraoka, Aruga, et al., 1993
Hiraoka, K.; Aruga, K.; Fujimaki, S.; Yamabe, S., Comparative Study of the Gas Phase Bond Strengths of CO2 and N2O with the Halide Ions, J. Am. Soc. Mass Spectrom., 1993, 4, 1, 58, https://doi.org/10.1016/1044-0305(93)85043-W . [all data]

Hao, Gilbert, et al., 2006
Hao, C.; Gilbert, T.M.; Sunderlin, L.S., The Bond Dissociation Energies of SO3-X- (X = F, Cl, Br, and I), Can. J. Chem., 2006, 83, 11, 2013-2019, https://doi.org/10.1139/v05-216 . [all data]

Lenzer, Furlanetto, et al., 1998
Lenzer, T.; Furlanetto, M.R.; Asmis, K.R.; Neumark, D.M., Zero electron kinetic energy and photoelectron spectroscopy of the XeI- anion, J. Chem. Phys., 1998, 109, 24, 10754-10766, https://doi.org/10.1063/1.477774 . [all data]

Wada, Kikkawa, et al., 2007
Wada, A.; Kikkawa, A.; Sugiyama, T.; Hiraoka, K., Thermochemical Stabilities of the Gas-phase Cluster Ions of Halide Ions with Rare Gas Atoms, Int. J. Mass Spectrom.., 2007, 267, 1-3, 284-287, https://doi.org/10.1016/j.ijms.2007.02.053 . [all data]