1-Buten-1-one,2-phenyl-
- Formula: C10H10O
- Molecular weight: 146.1858
- IUPAC Standard InChIKey: GFVFSRZJKWODDS-UHFFFAOYSA-N
- CAS Registry Number: 20452-67-9
- Chemical structure:
View 3d structure (requires JavaScript / HTML 5) - Permanent link for this species. Use this link for bookmarking this species for future reference.

Gas phase ion energetics data

Data compiled by: Sharon G. Lias, Rhoda D. Levin, and Sherif A. Kafafi
Ionization energy determinations
IE (eV) | Method | Reference |
---|---|---|
7.94 | EI | Compernolle and DeSchryver, 1975 |

References

Compernolle and DeSchryver, 1975
Compernolle, F.; DeSchryver, F.,
Nonconcerted cycloreversion by electron impact of substituted 2,4-azetidinediones. Relations between the mass spectral and photochemical reactions,
J. Am. Chem. Soc., 1975, 97, 3909. [all data]