Cyclohexanol, 2-(dimethylamino)-, cis-
- Formula: C8H17NO
- Molecular weight: 143.2267
- IUPAC Standard InChIKey: UFUVLAQFZSUWHR-SFYZADRCSA-N
- CAS Registry Number: 20431-82-7
- Chemical structure:
View 3d structure (requires JavaScript / HTML 5) - Stereoisomers:
- Other names: cis-2-(Dimethylamino)Cyclohexanol

Gas phase ion energetics data

Data compiled by: Sharon G. Lias, Rhoda D. Levin, and Sherif A. Kafafi
Ionization energy determinations
IE (eV) | Method | Reference | Comment |
---|---|---|---|
8.64 | PE | Brown, 1976 | Vertical value |

References

Brown, 1976
Brown, R.S.,
Application of photoelectron spectroscopy to intramolecularly hydrogen-bonded systems. Part III. The photoelectron spectra of cis and trans 2-substituted cyclopentanols cis and trans 2-substituted cyclohexanols,
Can. J. Chem., 1976, 54, 1929. [all data]