Cyclopentanol, 2-bromo-, trans-
- Formula: C5H9BrO
- Molecular weight: 165.028
- IUPAC Standard InChIKey: BQVWZYQFAVLQKE-RFZPGFLSSA-N
- CAS Registry Number: 20377-79-1
- Chemical structure:
View 3d structure (requires JavaScript / HTML 5) - Stereoisomers:
- Other names: trans-2-Bromocyclopentanol; 2-Bromocyclopentanol, (E)-

Gas phase ion energetics data

Data compiled by: Sharon G. Lias, Rhoda D. Levin, and Sherif A. Kafafi
Ionization energy determinations
IE (eV) | Method | Reference |
---|---|---|
10.11 ± 0.02 | PE | Botter, Menes, et al., 1973 |

References

Botter, Menes, et al., 1973
Botter, R.; Menes, F.; Gounelle, Y.; Pechine, J.M.; Solgadi, D.,
The ionization potentials of geometrical isomers: the cis and trans 2-subststituted cyclopentyl and cyclohexyl bromides,
Int. J. Mass Spectrom. Ion Phys., 1973, 12, 188. [all data]